program: Gaussian 09
title: 000284668
version: EM64L-G09RevD.01
frameworkgroup: C1[X(C17H14Cl3NO4)]
method: RPBEPBE
basis: SDD
operation: Freq
keyword: #p
keyword: freq=noraman
keyword: PBEPBE/SDD
title: #p freq=noraman PBEPBE/SDD
converged: YES YES NO NO
title: Mulliken charges:
elementType: Cl Cl Cl O O O O N C C C C C C C C C C C C C C C C C H H H H H H H H H H H H H H
charge: 0.024333 0.008256 0.013838 -0.319834 -0.287882 -0.160256 -0.300340 -0.370928 -0.186509 -0.679871 0.231117 -0.479986 0.469889 0.316554 0.592876 -0.368071 -0.387952 -0.324385 -0.327579 -0.233650 -0.224620 -0.060981 -0.187629 -0.232766 -0.095065 0.291730 0.223518 0.248973 0.235480 0.339978 0.246576 0.222226 0.274521 0.232171 0.281982 0.231043 0.227030 0.286201 0.230007
chargesum: 0.00000
title: Mulliken charges with hydrogens summed into heavy atoms:
elementType: Cl Cl Cl O O O O N C C C C C C C C C C C C C C C C C
charge: 0.024333 0.008256 0.013838 -0.319834 -0.287882 -0.160256 -0.300340 -0.030949 0.105222 0.028101 0.231117 -0.011184 0.469889 0.316554 0.592876 -0.093550 -0.155781 -0.324385 -0.045597 -0.002607 0.002411 -0.060981 0.098572 -0.002758 -0.095065
polarizability: 2.72023907e+02 6.81888642e+00 2.50812884e+02 6.50642899e+00 -6.45903687e+00 1.64025225e+02
1716.lowfreq: -9.1309 -5.7387 -2.7355 -0.0021 -0.0012 0.0007 3.9747 11.1591 13.2576
frequency: -7.1867 10.8526 12.6071 23.8699 36.7211 39.7652 50.1228 55.5056 75.3272 91.5125 124.5614 143.8189 159.4531 162.5555 175.1953 185.5482 205.6577 226.8625 234.3222 249.7748 275.0303 302.1463 310.4201 346.9694 351.2627 369.1543 387.5575 402.8783 410.6550 446.5805 482.1135 487.1906 530.6171 546.6270 574.5067 589.1535 592.7188 615.6312 617.9414 651.4461 667.7758 677.0337 691.9733 699.7666 706.2736 736.5728 758.1552 771.3411 814.5296 856.5916 856.8240 859.2579 880.6883 887.7562 900.1269 933.6547 963.8759 979.8177 983.3076 990.1719 1000.6361 1001.6116 1026.9446 1033.2402 1090.6546 1099.3819 1104.5133 1133.6647 1173.0838 1175.7212 1189.2244 1204.9189 1212.5300 1221.3912 1226.5112 1235.4106 1298.9634 1324.0514 1329.9451 1330.2574 1347.1828 1361.5103 1385.2257 1386.8389 1438.9650 1441.9534 1462.4234 1468.5460 1473.6292 1484.3050 1489.8554 1563.9660 1579.6974 1593.9801 1614.4183 1653.8373 1691.6103 2994.6505 3037.7875 3067.2300 3097.9078 3107.6490 3112.2679 3119.6346 3128.4840 3140.4899 3151.4460 3165.1165 3181.6348 3183.6181 3566.5977
redmass: 7.1374 13.6750 4.7208 9.7044 8.1094 6.5892 7.4111 6.0877 8.9164 11.3701 4.7049 6.0372 9.1453 6.1650 9.5778 6.4396 8.5758 5.0826 1.4250 2.9838 9.9430 5.4887 24.2500 3.6674 5.1033 4.1552 9.0755 2.8262 3.6452 3.1941 6.3647 4.6424 5.5274 5.2685 1.7595 4.4710 5.1060 4.3886 5.0136 5.5016 5.3586 4.4885 7.0002 3.9833 2.4393 5.1353 2.2753 5.2838 3.4954 1.8880 1.5495 2.2202 1.7483 3.3622 2.1981 1.4858 2.5293 1.7858 1.7192 5.1261 1.3398 2.7594 2.2232 6.3439 1.5297 2.6940 1.7509 4.0307 1.0596 3.0711 1.1329 4.6396 2.5307 2.7979 1.2682 1.1556 1.2636 1.2669 2.7037 1.8506 1.2746 10.4031 8.0470 1.2002 3.1685 2.1783 1.1356 1.0786 1.1315 2.2302 1.5787 10.6224 7.9923 6.0914 6.0685 9.1619 11.8860 1.0349 1.0588 1.0868 1.0995 1.1008 1.1070 1.0868 1.0875 1.0920 1.0964 1.1016 1.0926 1.0936 1.0771
irintensity: 0.0872 0.0103 0.3607 0.0865 0.5963 0.6017 0.4971 2.8270 6.1977 0.8813 1.1987 0.1505 0.5853 2.2409 0.5171 0.3808 0.7036 0.1325 2.5258 7.8760 1.8625 2.5935 0.0934 3.8470 4.7184 17.2560 5.9976 0.3003 3.6127 14.2210 3.5134 23.9270 8.0431 18.6377 109.5855 36.2507 5.8162 18.9426 11.6399 7.2574 8.1906 5.9070 5.8879 25.9866 80.3099 30.0455 55.8439 83.1629 10.3601 8.5544 4.0691 23.3518 39.8258 40.3999 40.4158 5.1919 118.4559 69.8225 76.6392 18.0124 6.3621 280.9866 5.5778 106.3420 7.2279 10.4497 91.3133 102.2357 0.7055 117.4832 3.1669 23.0924 241.2086 17.0654 7.3099 5.8104 13.1808 60.1969 13.9819 12.8220 14.1427 6.5427 0.6336 20.8062 261.3230 9.9955 7.2059 37.6307 97.3161 4.3905 248.9609 0.4594 6.0087 1.9289 0.7275 250.5601 162.8385 15.9002 39.7576 5.7498 19.7579 16.7273 5.4868 5.6714 2.6704 18.1835 23.3889 19.4734 2.2057 0.1824 36.9506
temp: 298.150 k
press: 1.00000 atm
elementType: 17 17 17 8 8 8 8 7 6 6 6 6 6 6 6 6 6 6 6 6 6 6 6 6 6 1 1 1 1 1 1 1 1 1 1 1 1 1 1
symmnumber: 1
zpe: 724190.8 jmol-1
zpe.correction: 0.275830 hartree
zpe.thermalcorrener: 0.299492 hartree
zpe.thermalcorrenthalpy: 0.300436 hartree
zpe.thermalcorrgfe: 0.217447 hartree
zpe.sumelectzpe: -2390.238709 hartree
zpe.sumelectthermal: -2390.215047 hartree
zpe.sumelectthermalent: -2390.214103 hartree
zpe.sumelectthermalfe: -2390.297092 hartree
dipole: 0.3752 0.2618 -2.8270
dipole: 2.8637
quadrupole: -175.8550 -146.4323 -167.6001
quadrupole: -7.3883 -5.0614 -6.8424
quadrupole: -12.5592 16.8635 -4.3043 -7.3883 -5.0614 -6.8424
hfenergy: -2390.5145385 hartree
pointgroup: C01 [X(C17H14Cl3N1O4)]
dipole: 0.3529946 -0.2289037 1.0451879 debye
polarizability: 257.3443236|-9.9689685|256.5696978|-30.3907187|5.404229|172.9479949 unknown
InChI: InChI=1S/C17H14Cl3NO4/c1-10(21-17(23)24-9-11-5-3-2-4-6-11)16(22)25-15-8-13(19)12(18)7-14(15)20/h2-8,10,21H,9H2,1H3
charge 0 multiplicity 1
39 atoms
Cl 0.133538 1.475593 -0.219725
Cl -5.715083 1.497464 2.445722
Cl -4.316225 4.309592 1.454684
O  -1.427545 -0.955168 0.83829
O  2.973747 -1.933873 0.729203
O  -1.959324 -1.226809 -1.438903
O  2.234224 -2.551712 -1.430466
N  0.799845 -2.507938 0.432152
C  -0.419232 -2.832252 -0.308962
C  -1.200877 -4.001762 0.338653
C  -1.336247 -1.606323 -0.440548
C  4.309424 -1.551863 0.150475
C  4.335178 -0.090262 -0.241793
C  2.01245 -2.345656 -0.20809
C  -2.121707 0.277892 0.927105
C  3.873997 0.317603 -1.521187
C  4.807092 0.889803 0.667631
C  -1.519983 1.486424 0.507971
C  -3.400421 0.293986 1.514159
C  3.878982 1.684064 -1.878186
C  4.815373 2.256652 0.310228
C  -4.078557 1.516723 1.682978
C  -2.197028 2.708937 0.669039
C  4.349785 2.656427 -0.964127
C  -3.478313 2.722554 1.258614
H  -0.113874 -3.101871 -1.334008
H  -1.489175 -3.758329 1.376506
H  -0.563568 -4.901574 0.349057
H  -2.116642 -4.224714 -0.236526
H  0.728103 -2.215019 1.407889
H  4.503944 -2.213831 -0.710721
H  5.006298 -1.77235 0.973915
H  3.501889 -0.439972 -2.220034
H  5.165225 0.581195 1.657692
H  -3.856874 -0.645881 1.83457
H  3.520731 1.989866 -2.867428
H  5.184234 3.006012 1.019518
H  -1.734117 3.644194 0.344961
H  4.356335 3.716181 -1.24331
