program: Gaussian 09
title: 000284806
version: EM64L-G09RevD.01
frameworkgroup: C1[X(C24HCl9O12)]
method: RPBEPBE
basis: SDD
operation: Freq
keyword: #p
keyword: freq=noraman
keyword: PBEPBE/SDD
title: #p freq=noraman PBEPBE/SDD
converged: YES YES NO NO
title: Mulliken charges:
elementType: Cl Cl Cl Cl Cl Cl Cl Cl Cl O O O O O O O O O O O O C C C C C C C C C C C C C C C C C C C C C C C C H
charge: 0.093791 0.092361 0.095992 0.093710 0.092065 0.097816 0.039983 0.101786 0.116123 -0.226840 -0.227636 -0.229916 -0.148241 -0.152203 -0.158010 -0.155743 -0.324789 -0.159465 -0.144992 -0.113204 -0.127068 0.557690 0.557328 0.554758 0.551083 -0.631395 0.239327 -0.624717 0.237707 -0.629672 0.235862 -0.622419 0.234495 0.576997 0.554023 -0.633063 0.240562 -0.611728 0.259358 -0.478461 0.157347 0.363003 -0.204107 0.348606 -0.267558 0.379455
chargesum: 0.00000
title: Mulliken charges with hydrogens summed into heavy atoms:
elementType: Cl Cl Cl Cl Cl Cl Cl Cl Cl O O O O O O O O O O O O C C C C C C C C C C C C C C C C C C C C C C C C
charge: 0.093791 0.092361 0.095992 0.093710 0.092065 0.097816 0.039983 0.101786 0.116123 -0.226840 -0.227636 -0.229916 -0.148241 -0.152203 -0.158010 -0.155743 0.054666 -0.159465 -0.144992 -0.113204 -0.127068 0.557690 0.557328 0.554758 0.551083 -0.631395 0.239327 -0.624717 0.237707 -0.629672 0.235862 -0.622419 0.234495 0.576997 0.554023 -0.633063 0.240562 -0.611728 0.259358 -0.478461 0.157347 0.363003 -0.204107 0.348606 -0.267558
polarizability: 1.02445576e+03 -9.01351500e+00 3.84689094e+02 -7.04689585e+00 -2.54480446e+00 2.81541365e+02
1716.lowfreq: -1.9438 -0.0014 0.0007 0.0020 0.7516 2.0696 8.8591 10.2799 13.0221
frequency: 8.7748 10.2274 12.9930 22.7976 26.6176 28.9783 33.2862 38.4097 44.0196 58.0353 60.4456 62.2633 63.6302 65.9350 70.2848 80.4328 88.4584 99.1416 100.6589 126.7926 132.3619 136.6412 138.6492 144.4496 173.3579 179.7453 185.3318 188.9811 189.7629 193.9223 201.1785 215.1700 224.6082 239.0092 247.4968 261.0392 273.4444 276.5131 281.2311 282.8439 283.6972 300.6608 308.8778 309.2922 313.1098 326.2784 333.5516 336.2518 342.1176 350.2682 354.2888 359.1632 369.8298 389.5509 404.8687 412.4690 413.6584 436.4691 438.1399 451.7900 454.9390 463.7735 469.8526 485.9923 508.4976 516.8801 545.1469 551.7988 555.1798 559.6369 564.0613 578.7888 590.1541 601.7370 706.2712 716.5461 720.2003 724.0722 727.7154 729.0572 729.1412 747.4640 774.9290 781.4718 802.8327 808.3455 820.5710 824.6908 828.4544 837.7865 843.8798 859.1276 862.6565 874.4890 909.0803 923.3905 944.9846 976.7209 1026.3770 1092.3888 1121.9215 1126.9557 1149.8703 1157.1892 1173.3114 1194.0148 1216.8763 1222.0926 1242.4155 1252.3744 1263.6263 1268.3687 1280.7366 1287.2264 1357.8008 1536.5166 1538.2289 1544.1044 1545.0801 1548.5131 1552.5564 1555.5819 1558.2170 1563.6675 1572.4427 1574.9063 1585.9908 1603.7968 1619.0726 1630.7114 1638.1391 3454.6104
redmass: 19.9750 18.4968 22.1763 25.7534 19.7602 15.3026 27.0872 18.2479 18.5441 28.9248 26.3003 22.5594 21.7251 22.6179 16.7276 17.1744 18.1070 13.1425 22.2904 27.4547 16.9147 16.4767 22.7906 19.9781 15.1939 14.1343 14.4593 20.3820 16.1582 22.4323 18.6019 16.3848 16.2902 17.2356 15.4537 15.9067 16.3175 16.2968 18.0197 15.6037 18.9015 14.5395 15.0602 16.9558 15.5872 13.0701 15.8499 15.8795 11.4722 17.8961 15.7574 17.5039 16.8746 15.4411 12.1062 12.9082 12.1055 13.0184 10.6729 14.2803 9.1257 14.2663 12.6448 8.5430 10.8509 7.8978 3.3854 8.4156 14.9010 7.6472 10.2355 2.9046 9.4142 12.2795 13.3103 12.1883 12.1066 12.2919 9.4409 11.2536 12.2228 12.4476 12.4815 13.1533 12.9574 12.6632 12.3165 12.3322 12.4704 13.1020 11.6950 12.1017 11.9023 12.9121 12.8977 10.8332 11.3590 11.7611 12.5699 12.4761 9.6422 3.5134 9.5013 11.7957 9.5755 8.8534 6.9443 10.9933 11.7259 11.9432 11.7600 12.3987 11.9350 12.2686 2.5522 13.0481 13.0100 12.8959 12.4368 13.0693 12.6173 13.0550 12.3415 12.9122 12.3332 12.3920 11.9230 12.0214 11.9813 12.0051 12.0268 1.0648
irintensity: 0.0809 0.1854 0.0235 0.0948 0.4882 0.8664 0.3489 0.1775 0.5843 0.1961 0.7556 0.7321 0.5984 1.2120 2.0246 1.3128 3.1199 1.7580 0.1333 0.0355 0.0360 0.0167 0.0711 0.0040 6.4082 12.7458 13.7867 0.6674 3.2331 0.4134 0.5284 3.6130 0.8995 4.2621 26.9320 2.3087 2.4159 0.3504 0.2193 1.0486 1.5246 0.1954 1.8250 1.4633 2.3846 2.3478 17.9457 18.1778 33.2982 5.7944 43.7489 49.3039 6.1619 2.4322 3.0132 2.5351 2.2022 11.4661 10.0116 2.5555 12.1649 6.5059 6.9875 16.6705 2.8040 6.3942 43.4242 24.4323 6.9176 5.0877 1.9268 97.7400 26.4150 3.0984 69.5837 17.7928 20.0435 17.9762 85.5906 14.8136 44.1620 17.1072 85.4570 86.2706 81.7403 20.9902 23.8486 11.1882 45.2020 20.0405 8.4084 34.3450 33.4951 24.0316 53.4606 2.9266 82.1319 241.1902 26.1440 108.3454 86.9019 1408.3971 753.2549 945.2263 43.8585 3.2614 7.3301 2.4707 14.4747 43.4836 3.9606 109.1552 55.1952 92.0751 30.6927 35.4814 130.3810 2385.4994 1704.8970 195.0939 37.4699 18.1429 560.7850 54.2572 180.8025 160.3537 114.5163 0.5936 28.3085 22.6296 4.1203 113.0617
temp: 298.150 k
press: 1.00000 atm
elementType: 17 17 17 17 17 17 17 17 17 8 8 8 8 8 8 8 8 8 8 8 8 6 6 6 6 6 6 6 6 6 6 6 6 6 6 6 6 6 6 6 6 6 6 6 6 1
symmnumber: 1
zpe: 529217.5 jmol-1
zpe.correction: 0.201568 hartree
zpe.thermalcorrener: 0.244074 hartree
zpe.thermalcorrenthalpy: 0.245018 hartree
zpe.thermalcorrgfe: 0.118087 hartree
zpe.sumelectzpe: -5955.029955 hartree
zpe.sumelectthermal: -5954.987450 hartree
zpe.sumelectthermalent: -5954.986505 hartree
zpe.sumelectthermalfe: -5955.113436 hartree
dipole: 1.3577 1.5681 -0.8769
dipole: 2.2520
quadrupole: -342.0311 -310.1285 -312.4536
quadrupole: 30.8373 -4.6866 -2.4600
quadrupole: -20.4934 11.4093 9.0841 30.8373 -4.6866 -2.4600
hfenergy: -5955.2315237 hartree
pointgroup: C01 [X(C24H1Cl9O12)]
dipole: 0.4975012 0.3497143 0.6443317 debye
polarizability: 1023.3966001|17.4021419|281.8666497|23.1681956|2.8393244|385.4229679 unknown
InChI: InChI=1S/C24HCl9O12/c25-1-2(26)13(37)19(4(28)10(1)34)43-21-6(30)17(41)23(8(32)15(21)39)45-24-9(33)16(40)22(7(31)18(24)42)44-20-5(29)12(36)11(35)3(27)14(20)38/h35H
charge 0 multiplicity 1
46 atoms
Cl -2.369715 -3.422087 -1.161626
Cl 2.37821 -3.284283 1.312281
Cl -2.576567 2.049945 2.30498
Cl 2.385969 2.011287 -2.426203
Cl 7.404676 0.178388 -2.770375
Cl -7.499641 0.025199 2.752039
Cl 6.689445 1.587846 3.521244
Cl -6.866677 1.140531 -3.589004
Cl -9.854762 0.762746 -2.246791
O  -0.021974 -1.966114 0.047433
O  4.799055 0.594348 -1.312766
O  -4.932732 0.503394 1.252079
O  -0.147558 0.394194 1.514724
O  0.015994 0.323148 -1.527734
O  -4.80655 -1.842987 -0.254589
O  4.758781 -1.686578 0.291839
O  9.32639 1.235919 1.953842
O  4.513189 1.147886 1.398626
O  -4.724391 0.954009 -1.491489
O  9.561516 0.666903 -0.687599
O  -9.693258 0.291686 0.691941
C  -1.235469 -1.305293 0.208531
C  1.169884 -1.277045 -0.155843
C  3.590745 0.061136 -0.878996
C  -3.705666 -0.013779 0.85262
C  -2.392584 -1.909868 -0.213256
C  -1.239042 -0.058624 1.061205
C  2.347273 -1.822157 0.288586
C  1.127599 -0.074315 -1.068324
C  2.416641 0.560196 -1.386691
C  3.640982 -1.202762 -0.052743
C  -2.552378 0.550254 1.337863
C  -3.706874 -1.313684 0.084208
C  5.921582 0.640879 -0.487459
C  -6.063484 0.448943 0.4357
C  7.172531 0.559168 -1.041294
C  5.69461 1.003897 0.960661
C  -7.303352 0.330998 1.005774
C  -5.880031 0.753583 -1.02164
C  6.898168 1.190702 1.765924
C  8.395917 0.75685 -0.222824
C  8.16912 1.076317 1.245828
C  -7.115787 0.831677 -1.848176
C  -8.54521 0.42395 0.190089
C  -8.356561 0.675585 -1.287912
H  9.133689 1.443413 2.911019
