program: Gaussian 09
title: 000284665
version: EM64L-G09RevD.01
frameworkgroup: C1[X(C18H20N2O4S)]
method: RPBEPBE
basis: SDD
operation: Freq
keyword: #p
keyword: freq=noraman
keyword: PBEPBE/SDD
title: #p freq=noraman PBEPBE/SDD
converged: YES YES NO NO
title: Mulliken charges:
elementType: S O O O O N N C C C C C C C C C C C C C C C C C C H H H H H H H H H H H H H H H H H H H H
charge: 0.931034 -0.529389 -0.527924 -0.261201 -0.441169 -0.281225 -0.082127 -0.422792 -0.623523 -0.504521 0.395240 0.260612 0.034178 -0.018979 -0.554029 -0.378130 0.342566 -0.375560 -0.275798 -0.233239 -0.369108 -0.362473 0.450120 -0.799573 -0.536359 0.249503 0.252166 0.280954 0.250043 0.256201 0.281498 0.273639 0.255967 0.243981 0.295173 0.275619 0.243652 0.242742 0.229737 0.229555 0.244506 0.368067 0.219753 0.224273 0.246343
chargesum: 0.00000
title: Mulliken charges with hydrogens summed into heavy atoms:
elementType: S O O O O N N C C C C C C C C C C C C C C C C C C
charge: 0.931034 -0.529389 -0.527924 -0.261201 -0.073102 -0.281225 -0.082127 0.078877 -0.092527 0.033178 0.395240 0.260612 0.034178 -0.018979 -0.280390 -0.122163 0.342566 -0.131579 0.019375 0.042380 -0.125456 -0.119731 0.450120 -0.095775 0.154009
polarizability: 3.47977827e+02 2.20415980e+01 2.59002023e+02 -1.11376921e+01 1.34870853e+01 1.76194572e+02
1716.lowfreq: -5.0169 -0.0007 -0.0004 0.0011 4.0241 5.6088 19.3844 22.7215 29.4337
frequency: 19.3375 22.6874 29.3955 33.1706 50.1083 57.7387 63.9989 90.2051 105.2017 118.6926 145.9917 158.0330 164.2573 198.3962 203.9193 222.2641 240.6614 248.8545 263.9604 271.1952 280.9845 300.9874 310.2333 331.8943 344.5165 361.5568 379.1012 399.3594 404.5407 408.4280 421.4474 430.8767 461.8315 466.8115 501.3502 515.3615 528.1373 567.9636 571.4086 594.2707 622.6758 652.6791 673.5193 698.2787 708.3760 717.0863 766.6340 775.5543 796.5299 813.1587 814.7193 824.9745 834.4589 853.0476 872.6941 901.5525 910.1526 924.1243 944.0764 955.5157 960.4745 969.2781 984.9486 990.7365 995.6876 1006.8519 1035.7169 1049.2464 1054.2897 1064.7137 1112.0882 1117.9351 1119.1970 1128.4687 1147.6360 1184.0546 1184.2267 1190.0251 1218.2413 1219.7437 1241.7601 1252.5118 1276.2818 1287.7631 1296.5761 1317.9397 1343.9401 1357.0092 1359.1964 1375.5292 1381.1595 1391.4876 1399.2067 1423.8301 1431.0665 1437.1602 1443.6236 1460.2087 1466.4234 1471.1761 1472.2491 1474.3989 1475.1246 1495.8164 1561.1674 1578.5782 1595.4043 1596.3581 1620.1458 2959.8732 2972.8183 2980.1505 2986.3461 3009.8588 3048.3537 3049.1629 3062.6144 3073.2640 3082.4479 3091.9876 3126.5746 3134.8725 3136.7430 3147.5633 3157.2043 3158.7293 3167.8378 3169.1634 3570.8781
redmass: 5.3467 5.2574 1.0785 3.3776 4.8806 6.0472 4.6987 3.8366 5.4086 5.7853 5.3360 4.7205 4.5996 7.9539 1.8639 7.3498 3.5332 2.0765 3.7236 3.8762 3.9292 4.6426 4.4082 4.4727 4.1213 5.0229 3.1496 3.2331 5.3169 2.9720 3.7094 1.3815 2.9534 4.1059 3.1661 3.8236 5.3328 3.4572 4.2171 5.7470 6.9578 3.3238 6.1804 3.9543 3.2913 4.2201 4.0852 5.5167 9.7041 1.5356 3.2935 1.3913 5.0190 1.2502 2.2028 4.4167 1.9912 13.5221 1.4506 2.0883 1.3560 3.8941 1.3816 1.4257 4.8380 3.7570 2.0816 1.5935 2.4847 4.2413 1.2603 1.3206 1.9376 2.6675 1.5147 1.1595 1.5736 1.1674 2.8761 1.9647 1.3692 2.1449 1.3998 1.2949 1.2674 1.2254 1.4388 1.6906 1.8458 2.6166 5.8442 3.0742 1.2199 1.9125 1.4489 1.2450 1.0844 1.0983 1.0504 1.0989 1.0723 1.4864 1.4409 2.7867 6.9297 7.1173 6.8861 6.0812 6.7565 1.0330 1.0671 1.0389 1.0613 1.0607 1.1040 1.1006 1.0948 1.0940 1.1023 1.1001 1.0994 1.0890 1.0894 1.0878 1.0920 1.0958 1.0961 1.0962 1.0673
irintensity: 2.1286 2.0599 0.4297 0.0026 0.5474 0.8376 0.3843 3.6218 1.8452 1.7760 1.3280 1.1194 1.3161 1.3165 2.8503 14.2935 8.9044 1.6856 2.8952 4.0894 15.9584 1.6458 6.4979 2.8136 2.5849 15.3255 0.2004 8.7988 16.3082 0.7299 10.5456 120.2286 13.4703 49.7118 25.1284 22.9085 58.7853 19.3673 39.6178 64.9847 0.3997 58.0294 16.8821 17.5863 0.6270 3.1963 13.7331 12.0801 72.6033 35.5362 54.7461 34.9720 84.8850 7.3810 33.3609 75.6001 11.5262 68.0987 5.4488 22.2027 3.0709 24.7894 1.5388 1.2591 1.9959 68.9423 7.5967 24.9041 29.6762 19.9819 0.1713 11.0442 31.4987 24.4637 2.1706 17.5766 14.9104 22.8769 6.0416 19.8381 69.0167 261.8450 19.0643 11.2522 2.7548 27.6925 1.8560 19.3403 1.9444 8.3212 0.2472 10.2477 15.8666 12.3256 30.5150 5.1275 14.5298 18.0875 13.2610 16.7485 45.5605 19.3636 18.9172 56.3738 1.8500 47.9003 0.7101 9.0751 120.4936 78.4344 8.6675 26.8883 22.8572 3.3433 45.2680 16.5152 18.4709 3.7339 8.5467 15.0196 25.1031 13.5730 9.5977 4.9547 1.0066 7.9655 5.2212 13.0544 59.1119
temp: 298.150 k
press: 1.00000 atm
elementType: 16 8 8 8 8 7 7 6 6 6 6 6 6 6 6 6 6 6 6 6 6 6 6 6 6 1 1 1 1 1 1 1 1 1 1 1 1 1 1 1 1 1 1 1 1
symmnumber: 1
zpe: 911865.7 jmol-1
zpe.correction: 0.347311 hartree
zpe.thermalcorrener: 0.372039 hartree
zpe.thermalcorrenthalpy: 0.372983 hartree
zpe.thermalcorrgfe: 0.290744 hartree
zpe.sumelectzpe: -1504.305610 hartree
zpe.sumelectthermal: -1504.280882 hartree
zpe.sumelectthermalent: -1504.279938 hartree
zpe.sumelectthermalfe: -1504.362177 hartree
dipole: 2.1953 2.7494 -1.3173
dipole: 3.7568
quadrupole: -98.9063 -154.5508 -153.8465
quadrupole: 5.5398 -7.5658 2.3651
quadrupole: 36.8615 -18.7830 -18.0786 5.5398 -7.5658 2.3651
hfenergy: -1504.6529208 hartree
pointgroup: C01 [X(C18H20N2O4S1)]
dipole: 0.861997 -1.0088568 0.6510185 debye
polarizability: 347.2327585|-18.4749045|259.2044783|22.7989591|6.4379549|176.7371849 unknown
InChI: InChI=1S/C18H20N2O4S/c1-13-3-6-16(7-4-13)25(22,23)20-10-9-18(19-21)17-8-5-15(24-2)11-14(17)12-20/h3-8,11,21H,9-10,12H2,1-2H3
charge 0 multiplicity 1
45 atoms
S  1.025937 0.972171 -0.183435
O  0.540055 2.455167 0.286826
O  0.752559 0.441472 -1.70951
O  -4.828111 2.596156 -0.199816
O  -1.660706 -4.56791 0.562172
N  0.36968 -0.180285 1.159333
N  -2.528906 -3.373321 0.617489
C  0.552741 -1.616032 0.832772
C  -0.958798 0.266807 1.660515
C  -0.42123 -2.251725 -0.198193
C  -2.192651 0.193121 0.755874
C  -2.679847 -1.033521 0.202743
C  -1.870307 -2.285905 0.252445
C  2.878638 0.799969 0.115455
C  -2.945969 1.370802 0.587977
C  -3.928962 -1.037192 -0.46178
C  -4.186286 1.35506 -0.097688
C  -4.692928 0.13896 -0.615277
C  3.641166 0.137074 -0.858272
C  3.43327 1.385636 1.264871
C  5.036127 0.045753 -0.652744
C  4.829144 1.280858 1.446702
C  5.648238 0.613197 0.49566
C  7.152117 0.541159 0.686916
C  -6.103792 2.641522 -0.919057
H  0.480405 -2.150609 1.800226
H  1.590748 -1.746483 0.47327
H  -0.829897 1.306149 2.004864
H  -1.125053 -0.362905 2.55973
H  -0.081681 -3.28572 -0.382272
H  -0.350325 -1.68034 -1.141649
H  -2.582732 2.324743 0.983289
H  -4.295565 -1.9812 -0.87681
H  -5.650378 0.097194 -1.142353
H  3.154565 -0.272216 -1.75001
H  2.799201 1.909606 1.986474
H  5.655512 -0.468576 -1.39653
H  5.288927 1.72561 2.336832
H  7.425602 0.513012 1.756017
H  7.582011 -0.349998 0.197917
H  7.64549 1.428785 0.245599
H  -2.287233 -5.279484 0.851168
H  -6.868895 2.012956 -0.422749
H  -5.982867 2.318884 -1.971389
H  -6.412915 3.696399 -0.887402
