program: Gaussian 09
title: 000284647
version: EM64L-G09RevD.01
frameworkgroup: C1[X(C17H15NO5)]
method: RPBEPBE
basis: SDD
operation: Freq
keyword: #p
keyword: freq=noraman
keyword: PBEPBE/SDD
title: #p freq=noraman PBEPBE/SDD
converged: YES YES NO NO
title: Mulliken charges:
elementType: O O O O O N C C C C C C C C C C C C C C C C C H H H H H H H H H H H H H H H
charge: -0.327394 -0.422413 -0.243208 -0.382461 -0.222268 -0.502484 0.510796 -0.512912 -0.471941 0.212215 -0.354202 0.431308 0.127665 -0.344040 0.257466 0.172676 -0.343747 -0.364327 0.041313 -0.224113 -0.233719 -0.225782 -0.523023 0.243412 0.217592 0.251678 0.254685 0.312760 0.273983 0.226316 0.234335 0.231440 0.234133 0.381821 0.225656 0.230217 0.245343 0.381223
chargesum: 0.00000
title: Mulliken charges with hydrogens summed into heavy atoms:
elementType: O O O O O N C C C C C C C C C C C C C C C C C
charge: -0.327394 -0.040592 -0.243208 -0.001238 -0.222268 -0.189725 0.510796 -0.269501 -0.254349 0.212215 -0.102524 0.431308 0.127665 -0.089355 0.257466 0.172676 -0.069763 -0.138011 0.041313 0.010222 -0.002279 0.008351 0.178194
polarizability: 4.26139545e+02 3.17283712e+00 1.80378726e+02 6.81307745e+00 -3.75890088e+00 1.45880943e+02
1716.lowfreq: -4.1904 -0.0007 -0.0006 0.0005 1.3690 7.8991 18.8683 24.0665 32.2105
frequency: 18.8302 24.0193 32.1350 43.8501 54.3231 81.2121 92.3435 109.7510 128.3283 139.8443 151.8058 171.0800 180.2078 192.5476 236.5963 244.0575 283.9365 294.6534 308.9883 329.4765 386.5160 401.8923 407.1257 416.3753 443.5210 475.8304 480.9898 509.9389 523.9495 539.7419 570.4206 580.9118 601.5505 614.3410 618.8080 637.1538 660.9809 688.0519 702.7757 713.3772 718.8115 740.8489 769.0949 788.6718 802.4708 825.0314 836.7995 855.6275 868.9689 882.4515 929.4198 936.2226 948.9672 983.9133 989.9103 1005.8954 1007.2085 1023.0851 1042.7304 1077.4063 1094.2511 1117.0042 1117.5322 1152.7043 1167.0467 1174.5605 1186.6216 1189.9475 1211.7369 1240.0351 1254.3333 1273.8581 1290.1266 1316.4714 1319.5498 1374.7092 1385.2582 1406.7180 1426.0889 1433.1046 1444.6807 1464.2731 1467.0121 1473.6204 1485.3034 1510.5994 1573.6490 1597.0765 1604.5129 1610.3413 1616.2621 1619.8699 1643.9734 2966.1543 3056.5086 3071.1044 3119.6799 3128.9744 3133.4246 3141.9103 3146.5516 3154.1709 3158.9736 3170.6908 3176.5630 3507.9447 3516.3217 3547.4818
redmass: 4.9736 4.9997 6.4370 6.6071 6.0548 4.5270 4.5971 5.7297 8.6524 5.9800 5.2065 3.7165 3.8399 1.9630 2.6634 5.0167 4.0590 6.9312 5.4105 4.8263 4.1729 2.9063 5.4637 4.5074 3.0962 4.1091 5.3228 1.0956 5.5710 3.2875 2.2151 1.3618 2.7898 5.9049 3.1895 5.1218 5.7784 5.3342 1.5569 6.3746 3.8220 4.8580 5.4124 2.6115 3.8176 1.4319 1.6425 1.2657 3.4921 1.9695 3.8505 1.4421 1.3877 1.5041 4.4628 1.3464 4.3199 2.6155 3.1200 1.9289 2.1275 1.3949 1.9390 1.3095 1.8860 1.0578 1.3663 1.1196 2.3448 2.3284 1.9215 1.8821 3.5464 1.4323 1.4894 3.3209 8.7372 2.8881 2.5008 2.0692 1.5313 1.0517 1.9893 1.0948 2.2467 3.2348 6.3274 6.1052 6.9816 6.1022 6.8284 8.2616 8.2045 1.0326 1.1045 1.0881 1.0875 1.0999 1.0871 1.0912 1.0919 1.0885 1.0959 1.1009 1.0968 1.0645 1.0639 1.0771
irintensity: 0.9298 0.4678 1.0766 1.7916 2.1932 4.6041 4.3714 4.7461 1.4490 0.9397 2.9147 0.4055 1.3955 3.8047 4.6634 1.6447 2.6130 12.7971 0.8734 4.6362 3.3949 0.1666 3.5647 13.0901 7.2032 22.1981 1.5494 141.4337 27.2417 3.3495 127.2882 47.0407 25.9530 3.2480 52.4263 0.8747 15.0544 18.5170 97.0426 11.5078 4.7787 5.1739 43.8981 17.3423 6.4839 18.3519 4.9953 0.8666 36.4518 28.3077 31.4828 3.1199 0.7792 2.1961 0.8449 2.1710 55.5413 12.4406 191.9716 41.5153 26.5984 12.7873 42.5557 11.6185 55.3249 1.6347 341.1594 2.0021 36.9866 36.1070 104.5952 96.5269 202.9319 17.0092 38.0772 251.7109 13.5901 23.1512 10.0967 18.1439 112.7774 16.4658 335.8366 41.3342 141.8253 68.0300 79.4034 46.1879 71.5086 14.9985 60.6489 138.4700 105.2705 52.7562 41.9470 32.5003 12.3802 26.3259 1.4096 8.0109 20.6638 4.8318 16.8446 26.2163 5.4870 153.8410 38.1180 11.6023
temp: 298.150 k
press: 1.00000 atm
elementType: 8 8 8 8 8 7 6 6 6 6 6 6 6 6 6 6 6 6 6 6 6 6 6 1 1 1 1 1 1 1 1 1 1 1 1 1 1 1
symmnumber: 1
zpe: 749849.6 jmol-1
zpe.correction: 0.285603 hartree
zpe.thermalcorrener: 0.306939 hartree
zpe.thermalcorrenthalpy: 0.307884 hartree
zpe.thermalcorrgfe: 0.232839 hartree
zpe.sumelectzpe: -1086.029281 hartree
zpe.sumelectthermal: -1086.007945 hartree
zpe.sumelectthermalent: -1086.007000 hartree
zpe.sumelectthermalfe: -1086.082045 hartree
dipole: -0.2660 6.7089 -0.3057
dipole: 6.7211
quadrupole: -112.3263 -122.6871 -133.7465
quadrupole: -1.8801 -10.8311 -2.1962
quadrupole: 10.5936 0.2329 -10.8265 -1.8801 -10.8311 -2.1962
hfenergy: -1086.3148839 hartree
pointgroup: C01 [X(C17H15N1O5)]
dipole: 0.0367743 -0.2404611 -2.633079 debye
polarizability: 426.2738219|2.0389467|145.3360006|-3.6832643|0.9216671|180.789391 unknown
InChI: InChI=1S/C17H15NO5/c1-23-15-10-11(7-8-14(15)19)9-13(17(21)22)18-16(20)12-5-3-2-4-6-12/h2-10,18-19,21H,1H3
charge 0 multiplicity 1
38 atoms
O  5.561309 -0.759007 -1.536378
O  6.375165 0.536427 0.655492
O  -2.614594 -1.152628 1.642342
O  0.552963 -1.001913 2.499379
O  -0.698866 0.9416 2.764086
N  -1.619029 0.168956 0.008422
C  2.203987 0.18239 -0.041096
C  3.143994 -0.365804 -0.967546
C  0.773588 0.042786 -0.343566
C  4.521033 -0.255891 -0.7260
C  2.701265 0.876455 1.097887
C  -0.297971 0.050738 0.515969
C  5.002798 0.422799 0.431826
C  4.085693 0.994114 1.332721
C  -4.069692 -0.073145 0.014615
C  -2.739885 -0.398087 0.630703
C  -5.142996 -0.965457 0.269531
C  -4.300241 1.085312 -0.7745
C  -0.201271 0.06593 2.019186
C  -6.418877 -0.719861 -0.276483
C  -5.580171 1.331674 -1.317595
C  -6.640054 0.426782 -1.076376
C  5.188436 -1.490841 -2.747401
H  2.774097 -0.895826 -1.85195
H  0.529403 -0.052144 -1.413667
H  2.005861 1.3646 1.786806
H  4.471904 1.536451 2.200429
H  -1.741137 0.627589 -0.895701
H  -4.951914 -1.837438 0.903565
H  -3.505941 1.826167 -0.928013
H  -7.24048 -1.416508 -0.078125
H  -5.754362 2.23345 -1.914587
H  -7.632557 0.620333 -1.498055
H  6.853317 0.078085 -0.086549
H  4.624972 -0.84099 -3.444182
H  4.585877 -2.385152 -2.498279
H  6.137789 -1.797477 -3.209941
H  0.582485 -0.951867 3.493335
