program: Gaussian 09
title: 000284611
version: EM64L-G09RevD.01
frameworkgroup: C1[X(C15H14O4)]
method: RPBEPBE
basis: SDD
operation: Freq
keyword: #pfreq=noraman
keyword: PBEPBE/SDD
title: #p freq=noraman PBEPBE/SDD
converged: NO YES NO NO
title: Mulliken charges:
elementType: O O O O C C C C C C C C C C C C C C C H H H H H H H H H H H H H H
charge: -0.305817 -0.171536 -0.204137 -0.218533 -0.332157 -0.249067 0.248067 -0.428179 0.481190 -0.452749 -0.201035 -0.212495 0.118606 0.156401 -0.834689 -0.242815 -0.267976 0.246078 -0.767659 0.301584 0.290248 0.289878 0.264756 0.254658 0.240001 0.230734 0.245522 0.234147 0.262442 0.261696 0.245723 0.271828 0.245286
chargesum: 0.00000
title: Mulliken charges with hydrogens summed into heavy atoms:
elementType: O O O O C C C C C C C C C C C C C C C
charge: -0.305817 -0.171536 -0.204137 -0.218533 -0.030573 0.041181 0.248067 -0.138301 0.481190 -0.187993 0.053623 0.027505 0.118606 0.156401 -0.124286 0.019627 -0.006280 0.246078 -0.004822
polarizability: 1.98049360e+02 -2.25436817e+01 1.59396917e+02 4.75347246e+00 7.60849238e+00 1.24885661e+02
1716.lowfreq: -32.2179 -12.5412 -11.7419 -5.3984 -0.0010 -0.0009 -0.0007 30.0023 57.6638
frequency: -32.1682 29.8583 57.6533 64.6297 84.2888 91.2700 109.3649 161.4902 188.8966 211.2681 239.9392 251.8453 264.2884 303.2315 327.0618 358.9767 378.0005 399.8598 441.3790 452.4899 471.5763 488.8023 512.4815 541.3839 575.8824 578.2230 582.1047 648.7483 655.4192 669.3642 695.4393 734.5350 745.5508 767.9462 785.9104 816.0404 839.0531 866.3244 886.7610 907.6573 925.8532 953.1937 963.3323 980.6908 1007.7114 1009.2278 1009.6911 1038.1096 1046.5336 1047.6341 1057.9024 1086.8796 1107.7357 1138.1685 1159.4753 1174.6440 1198.7770 1222.4951 1229.7102 1251.4672 1262.3406 1282.3087 1298.8766 1302.4704 1314.1921 1326.0833 1361.8044 1385.7776 1396.9560 1454.0237 1458.8908 1460.0415 1469.8190 1561.2555 1578.6451 1610.9715 1616.9865 1648.4944 1673.4946 2966.1384 3008.0221 3017.7944 3039.7728 3044.1531 3084.5891 3089.1963 3095.5069 3128.0125 3141.3118 3154.0422 3158.3114 3170.9576 3191.0160
redmass: 1.1316 6.8283 6.1518 5.2884 5.6691 3.2158 3.8720 4.9626 1.1303 4.3881 4.8526 3.5825 5.3431 4.1693 3.2978 4.5569 4.6105 5.4307 3.7573 5.9709 5.1253 4.1898 4.3861 3.8392 3.4887 3.5872 3.0060 4.2759 4.2333 1.9365 5.6996 3.4485 2.5248 5.5550 2.0651 3.2449 4.2845 2.1181 3.2449 3.2308 1.6360 3.6706 3.9292 2.1786 2.0365 1.4097 1.5823 2.6397 1.6382 1.5874 2.9185 1.7439 1.6496 1.3115 1.3641 3.1025 2.9567 1.7196 1.6507 1.3726 1.9030 1.6328 1.5554 1.5821 2.2619 1.7302 2.0311 1.2197 1.2396 1.0637 1.0468 1.0466 1.0657 11.0854 9.6200 6.2977 7.1909 11.1232 7.0589 1.0372 1.0365 1.0838 1.0968 1.0850 1.0973 1.0901 1.0971 1.0862 1.1014 1.1000 1.0875 1.0962 1.1061
irintensity: 2.0261 0.2765 2.6362 10.1226 6.4989 0.8742 2.1770 1.7472 0.3254 0.1750 4.0684 2.5652 1.1228 1.5664 5.0427 5.0370 9.7034 3.6633 6.9312 5.4998 0.6548 6.9998 6.3980 1.5778 1.2503 4.0343 1.5800 1.9924 1.3116 47.5697 2.3107 1.2487 5.5093 0.8407 8.5840 0.4734 10.9323 18.5264 30.1079 16.3492 4.1272 2.0221 99.2847 36.7234 4.7015 3.0384 23.9800 21.2294 7.4224 3.6022 67.5555 7.0048 44.6030 5.8439 4.5150 351.6428 89.7619 6.2232 13.6011 6.0075 24.8948 12.2995 21.1615 10.8226 14.7859 12.9144 3.4593 59.5646 17.5527 14.7227 13.9728 17.6967 15.6135 75.2937 214.7244 2.2410 12.5090 173.9636 9.9002 25.3963 3.0507 6.3212 14.0943 5.7778 10.9466 16.8234 5.7954 0.4688 4.9628 11.8110 4.6182 2.2125 5.9765
temp: 298.150 k
press: 1.00000 atm
elementType: 8 8 8 8 6 6 6 6 6 6 6 6 6 6 6 6 6 6 6 1 1 1 1 1 1 1 1 1 1 1 1 1 1
symmnumber: 1
zpe: 661214.8 jmol-1
zpe.correction: 0.251843 hartree
zpe.thermalcorrener: 0.268235 hartree
zpe.thermalcorrenthalpy: 0.269180 hartree
zpe.thermalcorrgfe: 0.207737 hartree
zpe.sumelectzpe: -879.462282 hartree
zpe.sumelectthermal: -879.445890 hartree
zpe.sumelectthermalent: -879.444945 hartree
zpe.sumelectthermalfe: -879.506389 hartree
dipole: -0.1032 0.0655 0.4911
dipole: 0.5061
quadrupole: -115.7852 -116.7606 -100.5430
quadrupole: -2.5892 2.6877 7.5160
quadrupole: -4.7556 -5.7310 10.4866 -2.5892 2.6877 7.5160
hfenergy: -879.714125 hartree
pointgroup: C01 [X(C15H14O4)]
dipole: 0.0411824 -0.046264 0.1892239 debye
polarizability: 190.2102576|-26.7434358|167.594303|-9.571567|-2.850113|124.5273784 unknown
InChI: InChI=1S/C15H14O4/c1-8-7-15(19-9(2)16)6-5-10(8)13-11(17)3-4-12(18)14(13)15/h3-7,10,13-14H,1-2H3
charge 0 multiplicity 1
33 atoms
O  2.06332 -0.756381 -0.225012
O  0.253544 -3.026914 -0.675054
O  -3.753566 0.559221 -0.022184
O  3.504672 0.927666 0.533885
C  -0.284468 -0.665546 -0.990882
C  -1.536676 0.264566 -0.981443
C  0.9278 0.175957 -0.332575
C  -1.088439 1.746719 -0.543444
C  -0.590204 1.593111 0.904238
C  0.461243 0.737481 1.002702
C  1.153485 1.314844 -1.327462
C  0.07718 2.130868 -1.447787
C  -0.458904 -2.03807 -0.335159
C  -2.696117 -0.141535 -0.060035
C  -1.266731 2.333535 2.027986
C  -1.520193 -2.21177 0.690604
C  -2.5697 -1.342098 0.800558
C  3.303162 -0.266394 0.225948
C  4.314752 -1.390182 0.273824
H  0.035335 -0.868837 -2.027768
H  -1.952056 0.335824 -2.003888
H  -1.95675 2.417445 -0.626237
H  0.971719 0.460552 1.928318
H  2.091123 1.385864 -1.883767
H  0.012254 2.980828 -2.132281
H  -0.819719 2.087659 3.006517
H  -2.349142 2.102946 2.067039
H  -1.182367 3.427851 1.878732
H  -1.461623 -3.128914 1.289718
H  -3.395395 -1.512718 1.502615
H  5.177492 -1.134274 -0.365504
H  3.870042 -2.338409 -0.059532
H  4.693727 -1.496695 1.305328
