program: Gaussian 09
title: 000284603
version: EM64L-G09RevD.01
frameworkgroup: C1[X(C11H18O3)]
method: RPBEPBE
basis: SDD
operation: Freq
keyword: #pfreq=noraman
keyword: PBEPBE/SDD
title: #p freq=noraman PBEPBE/SDD
converged: YES YES NO NO
title: Mulliken charges:
elementType: O O O C C C C C C C C C C C H H H H H H H H H H H H H H H H H H
charge: -0.312948 -0.282244 -0.266287 0.364433 -0.128645 -0.435082 -0.739440 -0.738679 -0.561136 0.521941 -0.835415 -0.486944 0.231453 -0.504410 0.214998 0.233321 0.222589 0.230059 0.209400 0.230206 0.210607 0.225010 0.236441 0.222692 0.223445 0.217414 0.239979 0.296703 0.250701 0.230900 0.238963 0.239976
chargesum: 0.00000
title: Mulliken charges with hydrogens summed into heavy atoms:
elementType: O O O C C C C C C C C C C C
charge: -0.312948 -0.282244 -0.266287 0.364433 0.086353 0.020828 -0.069775 -0.066621 -0.114999 0.521941 -0.081319 -0.236243 0.231453 0.205430
polarizability: 1.94712964e+02 1.38270481e+01 1.18621217e+02 -6.18195188e+00 1.16427640e+00 9.48882171e+01
1716.lowfreq: -5.4012 -0.0012 -0.0011 -0.0006 1.1512 10.8956 23.2638 27.7150 53.4166
frequency: 21.9787 27.5461 53.2535 57.2464 72.7361 92.5970 97.2757 122.9145 139.3443 156.4726 186.4474 207.5917 242.3238 259.9191 296.6434 304.5509 333.0142 353.6931 376.1472 388.9278 445.3514 472.5656 500.9020 571.1038 643.9154 690.6632 695.1257 710.9791 789.0802 823.4320 861.3469 875.5462 891.2518 935.1182 965.2474 975.2571 979.3093 1003.6548 1015.5348 1030.7968 1046.0762 1087.4762 1112.3622 1112.6510 1118.4500 1134.1344 1148.2044 1170.6269 1231.5251 1252.0899 1254.5821 1274.5844 1322.8460 1335.2022 1371.6010 1387.4105 1395.9630 1397.6005 1422.3758 1422.6143 1450.3371 1450.9598 1451.4408 1459.4367 1463.8130 1465.8748 1477.1534 1479.8932 1483.0631 1494.3229 1616.1829 1653.5879 2961.4621 2970.1812 2979.4987 2985.1813 3000.2724 3002.9654 3029.5689 3041.2287 3041.4860 3066.9912 3072.7947 3076.3989 3093.2141 3098.9076 3104.5734 3119.1703 3141.1434 3144.7741
redmass: 3.8679 3.5342 4.4497 3.2782 2.8301 1.1703 1.3675 2.0654 1.0660 2.9095 2.8180 1.1668 3.4698 2.9488 3.3194 4.0689 3.1147 2.3331 3.8062 2.7956 3.7278 3.0771 2.7727 2.7609 5.3530 4.9594 4.4135 2.8008 1.3399 4.2282 4.3941 4.2768 1.7379 1.4201 1.6279 1.7368 2.3097 1.6766 2.3606 1.3464 2.0533 2.0516 1.2789 1.8161 2.2635 2.2229 1.4608 1.2989 2.7049 2.1031 1.3835 1.2739 1.5443 1.5824 1.3940 1.3183 1.2850 1.2591 2.0346 1.1969 1.0501 1.0762 1.0654 1.0742 1.0517 1.0754 1.0664 1.0892 1.2122 1.1083 8.3523 6.5241 1.0613 1.0405 1.0367 1.0374 1.0298 1.0633 1.0971 1.0902 1.0927 1.0984 1.0979 1.0994 1.0995 1.1040 1.0978 1.0972 1.0905 1.1043
irintensity: 0.7909 0.3678 1.6751 0.5353 2.1917 0.7324 1.0154 0.7228 0.2228 2.6161 3.3575 0.1394 2.0892 3.5334 11.8352 9.2729 0.7988 1.3612 4.7376 9.1948 17.0399 3.0923 8.0249 8.1218 10.0925 5.7113 7.1352 7.4059 3.3049 0.7665 12.9113 26.8246 28.5193 1.2864 1.2980 4.2526 10.1234 19.3662 21.2786 2.0279 38.7611 106.7498 0.4887 29.4171 276.7650 9.2626 8.9911 2.4962 64.9396 13.8357 9.2680 5.1290 12.1772 1.5173 37.4501 29.0302 33.5732 15.4196 4.5338 21.1637 13.2187 39.6662 6.4293 19.0126 12.2812 13.6281 12.1831 28.3811 9.4059 13.3644 160.7290 203.9310 16.1937 26.8068 20.2163 27.8693 42.0985 23.2455 11.5698 14.2994 25.8007 0.9490 48.6859 41.4422 28.3540 29.9482 32.1107 0.7166 6.9890 20.4457
temp: 298.150 k
press: 1.00000 atm
elementType: 8 8 8 6 6 6 6 6 6 6 6 6 6 6 1 1 1 1 1 1 1 1 1 1 1 1 1 1 1 1 1 1
symmnumber: 1
zpe: 703051.7 jmol-1
zpe.correction: 0.267778 hartree
zpe.thermalcorrener: 0.284995 hartree
zpe.thermalcorrenthalpy: 0.285939 hartree
zpe.thermalcorrgfe: 0.220688 hartree
zpe.sumelectzpe: -654.483352 hartree
zpe.sumelectthermal: -654.466135 hartree
zpe.sumelectthermalent: -654.465191 hartree
zpe.sumelectthermalfe: -654.530442 hartree
dipole: 0.3298 -0.8979 -2.4431
dipole: 2.6237
quadrupole: -83.3813 -85.1613 -88.9551
quadrupole: 7.6676 -10.7830 -0.1141
quadrupole: 2.4513 0.6712 -3.1225 7.6676 -10.7830 -0.1141
hfenergy: -654.7511301 hartree
pointgroup: C01 [X(C11H18O3)]
dipole: 0.1155811 -0.0041166 -1.0257352 debye
polarizability: 193.7913377|17.3241685|116.0337645|-2.7054575|8.1727065|98.3972959 unknown
InChI: InChI=1S/C11H18O3/c1-8(7-10(12)13-4)5-6-9-11(2,3)14-9/h7,9H,5-6H2,1-4H3
charge 0 multiplicity 1
32 atoms
O  3.935676 -0.683827 1.191469
O  -4.271814 -1.096279 -0.408401
O  -3.92023 0.942897 0.667319
C  3.926294 0.010664 -0.17119
C  2.746451 -0.822306 0.264574
C  1.420644 -0.267231 0.753082
C  3.909406 1.529883 -0.106502
C  4.909804 -0.589322 -1.165593
C  0.431685 -0.062334 -0.433054
C  -0.946933 0.411052 0.005228
C  -0.999224 1.735507 0.736956
C  -2.04242 -0.365413 -0.27578
C  -3.444662 -0.055594 0.063785
C  -5.716321 -0.924021 -0.141093
H  2.676638 -1.826748 -0.185378
H  0.981739 -0.974216 1.483597
H  1.583779 0.683528 1.288926
H  4.911232 1.904226 0.172569
H  3.652313 1.958183 -1.093823
H  3.191287 1.906575 0.639107
H  4.652673 -0.292072 -2.199977
H  5.937437 -0.240569 -0.955261
H  4.905788 -1.69101 -1.105494
H  0.870131 0.692654 -1.119229
H  0.34457 -1.006767 -1.003309
H  -0.335558 2.472866 0.246098
H  -0.62805 1.61516 1.774283
H  -2.023511 2.130391 0.796591
H  -1.90952 -1.314187 -0.807812
H  -6.190036 -1.82214 -0.562035
H  -6.092375 -0.009637 -0.63111
H  -5.900997 -0.848309 0.944151
