program: Gaussian 09
title: 000284618
version: EM64L-G09RevD.01
frameworkgroup: C1[X(C14H24O4)]
method: RPBEPBE
basis: SDD
operation: Freq
keyword: #pfreq=noraman
keyword: PBEPBE/SDD
title: #p freq=noraman PBEPBE/SDD
converged: YES YES NO NO
title: Mulliken charges:
elementType: O O O O C C C C C C C C C C C C C C H H H H H H H H H H H H H H H H H H H H H H H H
charge: -0.299361 -0.269430 -0.280971 -0.282173 -0.138985 -0.113969 -0.056916 -0.473001 -0.483674 0.299345 -0.372215 -0.764142 -0.744331 -0.756641 0.314430 0.335008 -0.787220 -0.764695 0.306139 0.204014 0.240554 0.197168 0.226940 0.215834 0.200761 0.262180 0.223680 0.220102 0.221674 0.206077 0.219414 0.266294 0.222963 0.215017 0.232273 0.230625 0.239517 0.295658 0.236533 0.240475 0.276189 0.238860
chargesum: 0.00000
title: Mulliken charges with hydrogens summed into heavy atoms:
elementType: O O O O C C C C C C C C C C C C C C
charge: -0.299361 -0.269430 -0.280971 -0.282173 0.167154 0.090045 0.183637 -0.048892 -0.067079 0.299345 0.113645 -0.116289 -0.035661 -0.078726 0.314430 0.335008 -0.015512 -0.009171
polarizability: 1.83469773e+02 -1.29107861e+00 1.52709227e+02 -1.02103699e+00 -1.77872500e+00 1.42151004e+02
1716.lowfreq: -7.8771 -4.4812 -0.0006 0.0002 0.0006 10.8191 17.9396 50.9575 54.6104
frequency: 17.5113 50.9570 54.5912 71.8290 86.3796 98.6779 113.7455 119.9687 127.1588 130.6148 169.0728 172.0102 184.8787 198.3169 209.1609 223.1369 231.7221 272.3529 287.7426 293.0591 302.0108 330.1502 355.6040 371.5255 398.6178 418.7645 476.4279 506.4392 510.7084 558.7468 579.6694 590.0772 600.9574 617.6926 639.0020 711.1091 760.7234 802.5161 815.3658 847.4850 888.9697 900.2303 911.2916 925.1552 931.9561 944.9205 971.4712 989.8146 1000.9849 1003.4761 1005.1760 1027.0455 1042.8901 1047.3739 1054.7671 1089.7557 1092.2430 1120.6688 1126.9712 1134.0996 1167.3688 1194.1946 1202.5156 1204.4893 1217.5219 1227.9523 1245.7734 1265.0308 1283.0907 1287.9150 1293.5225 1306.2689 1332.4794 1347.5539 1352.5652 1366.9532 1377.9506 1382.2787 1386.0392 1388.6679 1395.9864 1453.5836 1454.4812 1455.8777 1458.3958 1464.8897 1465.7588 1470.0952 1472.4572 1474.9991 1477.0537 1483.4723 1490.9899 1496.3097 1620.6092 1638.6899 2957.5780 2966.8546 2972.7055 2990.6522 2994.8308 2996.5389 2998.6572 3002.4678 3005.6488 3016.1694 3031.9972 3044.0416 3059.9132 3066.3782 3068.8644 3085.6983 3092.1943 3093.0919 3095.1154 3098.8176 3101.5199 3116.1997 3134.9449 3139.1572
redmass: 3.5334 4.4978 5.1948 4.1296 3.0868 4.6547 1.2166 2.3732 1.1413 2.1561 3.4243 4.0253 2.8672 5.2292 1.1252 1.1178 1.3265 2.2198 2.5123 3.0368 2.3829 3.4463 2.7978 2.8876 2.3770 2.7418 3.1052 2.8408 3.0929 3.5112 3.3952 4.0131 3.4820 3.9217 3.7523 3.2531 2.5276 3.1463 2.0928 2.3878 3.3060 2.1869 2.6942 3.0068 1.5549 1.5531 2.1741 1.6962 1.7586 1.4671 1.6195 3.1423 1.9208 1.6437 1.6185 1.6440 2.2528 2.0066 2.1259 1.9320 1.8491 2.3631 2.2048 1.5859 3.1592 1.5694 1.5674 1.8802 1.4444 1.2818 1.3959 1.3078 1.4238 1.5093 1.4641 1.4282 1.2168 1.2498 1.2213 1.2191 1.2319 1.0575 1.0556 1.0527 1.0601 1.0625 1.0722 1.0580 1.0637 1.0567 1.0596 1.0818 1.0619 1.0584 9.1478 9.0765 1.0800 1.0372 1.0669 1.0791 1.0370 1.0388 1.0366 1.0383 1.0610 1.0623 1.0870 1.0973 1.0992 1.0985 1.1014 1.0988 1.1015 1.0934 1.0991 1.0940 1.0993 1.1001 1.1023 1.1025
irintensity: 0.0790 1.2124 1.7673 1.9915 0.4080 2.9500 2.3485 1.3364 1.1666 3.4137 1.7579 0.9464 5.8163 9.1011 0.6954 1.4117 3.2673 1.8518 1.6224 1.4390 5.5220 2.9725 1.0147 1.0865 2.5654 1.7530 2.0026 4.3567 3.1691 5.3055 4.4093 2.4224 6.0673 4.5417 3.6504 1.1373 18.0074 3.2081 1.7544 1.6616 24.6477 13.5425 33.2867 24.6511 10.8056 2.9857 2.1935 8.4092 3.4783 39.9165 64.4633 17.2092 2.4469 15.2366 17.2360 15.4217 3.0527 73.4129 35.1612 45.2950 0.4713 22.7715 65.3773 4.9226 450.7715 60.4301 8.3870 15.0418 5.4088 1.3053 1.7129 1.4196 6.8351 0.8940 0.4919 3.4625 36.9773 73.2014 68.8149 8.6624 26.7008 24.4940 7.8323 4.6936 18.8380 19.7567 5.3005 1.6152 10.6547 4.5237 18.2729 1.2230 18.9990 20.0176 125.2412 215.4913 8.8044 31.7877 30.7725 24.9096 13.2942 7.9911 16.2010 2.1092 58.8187 36.4076 3.0478 14.5934 19.1736 36.7890 87.7503 12.7586 12.3385 4.7449 38.6202 8.5521 24.8417 11.6342 8.7942 10.3724
temp: 298.150 k
press: 1.00000 atm
elementType: 8 8 8 8 6 6 6 6 6 6 6 6 6 6 6 6 6 6 1 1 1 1 1 1 1 1 1 1 1 1 1 1 1 1 1 1 1 1 1 1 1 1
symmnumber: 1
zpe: 940561.2 jmol-1
zpe.correction: 0.358241 hartree
zpe.thermalcorrener: 0.379187 hartree
zpe.thermalcorrenthalpy: 0.380132 hartree
zpe.thermalcorrgfe: 0.308635 hartree
zpe.sumelectzpe: -847.367055 hartree
zpe.sumelectthermal: -847.346109 hartree
zpe.sumelectthermalent: -847.345165 hartree
zpe.sumelectthermalfe: -847.416661 hartree
dipole: -2.6557 0.6906 0.0193
dipole: 2.7441
quadrupole: -110.1713 -105.6530 -110.9478
quadrupole: 0.7198 2.1532 -4.8164
quadrupole: -1.2473 3.2711 -2.0238 0.7198 2.1532 -4.8164
hfenergy: -847.7252963 hartree
pointgroup: C01 [X(C14H24O4)]
dipole: -1.0664318 0.1653515 0.0309304 debye
polarizability: 179.5461781|-10.4208|156.3928062|-0.8907117|-2.2808798|142.39102 unknown
InChI: InChI=1S/C14H24O4/c1-9-6-7-13(12(9)8-17-10(2)15)14(4,5)18-11(3)16/h9,12-13H,6-8H2,1-5H3
charge 0 multiplicity 1
42 atoms
O  0.128508 -1.927409 0.832153
O  1.323462 1.471905 -0.311441
O  1.357854 -1.857339 -1.169541
O  3.263067 0.657811 0.694481
C  -1.193945 -0.139984 -0.400652
C  -0.913932 1.046414 0.579234
C  -1.564342 2.275412 -0.124279
C  -2.544989 0.241624 -1.116606
C  -2.890839 1.689661 -0.664156
C  -1.229504 -1.577078 0.203241
C  0.556285 1.255909 0.954124
C  -1.749523 3.509808 0.77646
C  -1.547016 -2.640538 -0.871462
C  -2.167443 -1.725555 1.414979
C  1.282782 -2.085345 0.063913
C  2.664848 1.086668 -0.321644
C  2.438614 -2.53325 0.934674
C  3.245552 1.208598 -1.710643
H  -0.39066 -0.139672 -1.159275
H  -1.459572 0.884407 1.534325
H  -0.917636 2.548761 -0.983076
H  -3.365095 -0.453068 -0.859939
H  -2.417491 0.186794 -2.212295
H  -3.319415 2.299064 -1.480272
H  -3.637067 1.67049 0.155896
H  0.986417 0.394474 1.490129
H  0.689634 2.160243 1.576259
H  -0.782615 3.914364 1.129139
H  -2.26453 4.322358 0.231108
H  -2.361422 3.263119 1.666345
H  -2.607633 -2.569731 -1.169413
H  -0.915533 -2.511073 -1.763886
H  -1.378509 -3.651877 -0.45971
H  -3.186379 -1.383924 1.161569
H  -1.802946 -1.140369 2.275364
H  -2.221719 -2.783064 1.725214
H  2.082637 -3.043037 1.842337
H  3.024599 -1.642505 1.229112
H  3.09995 -3.194447 0.351999
H  2.791527 2.046657 -2.261767
H  3.019703 0.273821 -2.25712
H  4.337815 1.327999 -1.651979
