program: Gaussian 09
title: 000284592
version: EM64L-G09RevD.01
frameworkgroup: C1[X(C10H16O2)]
method: RPBEPBE
basis: SDD
operation: Freq
keyword: #pfreq=noraman
keyword: PBEPBE/SDD
title: #p freq=noraman PBEPBE/SDD
converged: NO YES NO NO
title: Mulliken charges:
elementType: O O C C C C C C C C C C H H H H H H H H H H H H H H H H
charge: -0.229771 -0.210384 -0.187476 -0.259848 0.342461 -0.416374 -0.446146 -0.400366 -0.406485 0.151094 -0.731631 -0.730559 0.237479 0.252394 0.206141 0.211378 0.198862 0.234466 0.204787 0.187776 0.208190 0.216673 0.226921 0.242921 0.214916 0.231535 0.243323 0.207725
chargesum: 0.00000
title: Mulliken charges with hydrogens summed into heavy atoms:
elementType: O O C C C C C C C C C C
charge: -0.229771 -0.210384 0.050003 -0.007454 0.342461 0.001144 -0.012819 -0.007803 0.018377 0.151094 -0.046873 -0.047976
polarizability: 1.19795479e+02 7.35454789e+00 1.06938197e+02 -1.27501179e+00 -9.23188475e-01 9.18321569e+01
1716.lowfreq: -16.9321 -11.8069 -0.0010 -0.0008 0.0003 6.5630 92.8054 109.0812 142.1216
frequency: 92.7843 109.0723 142.1165 166.2896 202.3915 224.6466 246.3904 295.0251 313.8740 332.2251 347.0821 415.5495 443.0178 463.5728 510.4501 548.8138 564.9191 584.6114 685.6382 752.6199 779.4990 809.8601 848.0238 853.9911 886.3234 917.5606 924.8093 931.5761 950.8861 988.7175 997.3192 1037.8618 1066.6862 1076.1007 1099.3307 1111.8663 1135.9803 1152.7011 1176.3807 1220.9310 1225.5284 1242.5587 1259.2215 1273.2525 1299.6367 1304.2709 1313.8048 1336.8276 1344.7516 1353.4386 1359.7169 1383.4707 1397.7755 1451.4359 1458.3600 1464.1343 1468.3888 1470.2947 1472.2393 1478.9497 1492.4032 1694.7346 2964.5159 2966.2218 2974.3031 2982.7265 2986.5721 2990.4100 2996.4340 3008.9228 3034.5992 3039.0001 3044.0623 3053.5882 3084.8175 3088.6535 3098.5552 3112.1626
redmass: 4.2058 3.4914 2.8381 1.1072 1.4254 1.5962 2.3727 2.7860 3.2352 2.3002 2.1565 3.2749 3.3929 3.3620 3.3380 2.1491 3.5565 5.4850 4.4886 2.9972 1.9358 5.1184 1.8024 3.1821 2.7720 1.5948 2.4229 1.5139 1.8159 2.0956 1.3281 2.6919 1.6409 1.7967 2.0285 1.1729 1.6615 2.6052 1.7466 1.7158 1.7715 1.4856 3.1175 1.4089 1.5179 1.5970 1.4251 1.3919 1.4556 1.4599 1.4316 1.2316 1.2067 1.0496 1.0833 1.0681 1.0820 1.0675 1.0692 1.0804 1.0556 12.3861 1.0768 1.0644 1.0613 1.0609 1.0667 1.0375 1.0376 1.0854 1.0963 1.0992 1.0999 1.1033 1.0988 1.0991 1.0993 1.0990
irintensity: 2.2645 0.4314 1.3759 0.0603 0.4549 0.4405 2.8099 0.8727 2.4797 1.3778 0.6073 0.1599 0.4183 2.6658 5.8312 2.1776 0.8516 6.6858 1.2728 1.3383 1.1245 21.8410 10.2569 31.0175 24.1772 9.9361 22.8237 5.1149 4.8697 10.2328 1.0059 120.7563 0.4076 4.4317 55.5741 3.0444 17.5191 8.3585 9.8619 12.9644 5.3947 6.8619 51.0652 8.1301 8.4699 5.1335 6.7013 0.2626 1.0070 0.4660 3.4653 31.7846 22.1487 3.3256 11.9615 12.6056 10.9523 10.9668 4.7280 7.5557 10.9176 283.9440 20.2582 29.4060 27.5103 26.3500 25.7367 20.9122 20.1537 22.0932 52.7000 56.7119 17.2147 60.3207 15.9334 26.8594 29.8548 24.6966
temp: 298.150 k
press: 1.00000 atm
elementType: 8 8 6 6 6 6 6 6 6 6 6 6 1 1 1 1 1 1 1 1 1 1 1 1 1 1 1 1
symmnumber: 1
zpe: 636283.1 jmol-1
zpe.correction: 0.242347 hartree
zpe.thermalcorrener: 0.253864 hartree
zpe.thermalcorrenthalpy: 0.254808 hartree
zpe.thermalcorrgfe: 0.206030 hartree
zpe.sumelectzpe: -540.183643 hartree
zpe.sumelectthermal: -540.172127 hartree
zpe.sumelectthermalent: -540.171182 hartree
zpe.sumelectthermalfe: -540.219961 hartree
dipole: -0.2661 -4.2909 2.9732
dipole: 5.2271
quadrupole: -69.4686 -82.0698 -73.4530
quadrupole: 1.0596 -1.4915 6.2419
quadrupole: 5.5285 -7.0727 1.5442 1.0596 -1.4915 6.2419
hfenergy: -540.4259903 hartree
pointgroup: C01 [X(C10H16O2)]
dipole: 0.0348091 1.7214474 1.1245298 debye
polarizability: 119.2476861|7.8059593|107.5026645|1.3126193|0.626968|91.8154824 unknown
InChI: InChI=1S/C10H16O2/c1-10(2)8-6-4-3-5-7(8)9(11)12-10/h7-8H,3-6H2,1-2H3
charge 0 multiplicity 1
28 atoms
O  1.387382 -0.848807 -0.71579
O  -0.240098 -2.504469 -0.837757
C  0.163864 0.796569 0.563159
C  -0.468508 -0.607684 0.793544
C  1.616156 0.423683 0.100399
C  -0.630111 1.606765 -0.494088
C  -2.009186 -0.690246 0.850815
C  -2.148837 1.615282 -0.208648
C  -2.702631 0.173267 -0.225719
C  0.170518 -1.449303 -0.325504
C  2.541855 0.059053 1.277877
C  2.306678 1.414119 -0.844254
H  0.205789 1.370493 1.508375
H  -0.072326 -1.031855 1.74031
H  -0.471779 1.161121 -1.497399
H  -0.2380 2.640277 -0.539344
H  -2.341329 -0.352213 1.852489
H  -2.30511 -1.750915 0.746434
H  -2.665937 2.235825 -0.965133
H  -2.347786 2.080311 0.779628
H  -3.795257 0.172125 -0.051613
H  -2.536224 -0.271637 -1.227052
H  2.060802 -0.630368 1.992949
H  3.455497 -0.428322 0.897369
H  2.837271 0.972563 1.825493
H  3.306417 1.036571 -1.119555
H  1.731834 1.560672 -1.771913
H  2.430154 2.393222 -0.346271
