program: Gaussian 09
title: 000284614
version: EM64L-G09RevD.01
frameworkgroup: C1[X(C15H22O5)]
method: RPBEPBE
basis: SDD
operation: Freq
keyword: #pfreq=noraman
keyword: PBEPBE/SDD
title: #p freq=noraman PBEPBE/SDD
converged: NO YES NO NO
title: Mulliken charges:
elementType: O O O O O C C C C C C C C C C C C C C C H H H H H H H H H H H H H H H H H H H H H H
charge: -0.465459 -0.270899 -0.266056 -0.226458 -0.268956 0.446999 -0.389876 0.182156 -0.271819 -0.587641 -0.319758 0.481530 -0.469037 -0.786855 -0.800754 0.186252 0.206501 -0.859613 -0.502794 -0.501179 0.270338 0.307650 0.226278 0.248369 0.338892 0.268758 0.238095 0.205506 0.214909 0.219529 0.217889 0.228487 0.360567 0.229057 0.228306 0.233584 0.243345 0.241603 0.232665 0.249117 0.236248 0.244522
chargesum: 0.00000
title: Mulliken charges with hydrogens summed into heavy atoms:
elementType: O O O O O C C C C C C C C C C C C C C C
charge: -0.104891 -0.270899 -0.266056 -0.226458 -0.268956 0.446999 -0.119537 0.182156 0.035831 -0.112993 0.019134 0.481530 -0.200279 -0.128345 -0.134850 0.186252 0.206501 -0.168665 0.214818 0.228709
polarizability: 1.87067854e+02 1.26869752e-01 1.65974668e+02 2.92760753e+00 5.25637834e+00 1.56217454e+02
1716.lowfreq: -14.2334 -10.8222 -0.0006 -0.0006 0.0001 4.4589 24.3518 41.1764 55.5825
frequency: 24.1537 41.1642 55.5455 75.8676 91.0050 105.0635 106.2818 112.6729 132.7306 144.1153 169.2920 175.1816 182.8920 214.5138 234.1371 245.6551 255.9367 259.2330 278.4885 290.5728 299.1559 325.2590 345.5077 357.0970 375.1722 423.4409 427.1742 450.4824 453.5183 505.5946 518.4983 549.4891 572.4916 587.5625 597.3557 620.5392 683.4453 711.6759 747.8435 799.2150 806.7619 817.6056 830.7154 878.2628 893.1776 914.6984 922.4268 938.7388 949.4192 957.8444 979.9771 982.2510 997.7078 1012.0335 1026.1129 1046.0155 1057.9848 1088.7991 1093.3683 1113.4955 1113.7246 1141.1853 1147.8356 1148.9665 1153.6993 1159.6349 1171.2537 1182.8733 1203.7683 1214.1439 1224.7316 1245.1667 1258.7540 1273.2425 1278.1454 1300.6768 1334.0192 1347.4141 1375.3068 1393.2987 1397.0326 1401.1927 1420.8491 1421.9566 1452.0139 1452.6840 1458.4206 1462.4709 1464.1533 1464.9659 1467.1428 1472.0606 1474.4781 1482.3526 1495.9889 1594.4588 1637.5061 1677.3780 2958.0971 2965.7463 2969.6493 2971.4548 2989.2842 3003.7728 3009.7737 3027.9459 3042.3877 3052.2880 3054.2312 3061.2813 3064.2150 3066.2488 3075.5787 3078.3869 3105.5919 3114.9977 3148.0750 3155.1394 3162.0172 3424.7081
redmass: 4.6522 5.3349 5.4960 3.5159 3.5499 1.2053 1.5569 1.5488 2.9953 3.3010 3.3486 1.1775 2.8618 2.5741 1.2702 2.0255 3.4697 3.8564 1.9625 4.1221 3.7243 2.7234 4.4897 2.8896 5.4349 2.8900 2.7741 3.5267 3.2688 3.8682 4.8365 3.8114 4.5661 1.2330 3.0209 3.8047 5.2452 5.3891 5.2031 2.8152 4.8048 2.0231 3.1320 2.9297 4.3162 2.2192 2.8161 1.4727 2.0942 4.4230 3.9433 2.9254 1.5935 1.9244 1.9214 1.6431 2.3204 2.8646 3.5788 1.2714 1.2673 2.8731 1.4652 1.4909 1.8321 1.8001 1.6950 2.3737 2.1893 2.9267 1.6170 1.6863 1.5413 1.4340 1.4035 1.5664 2.0844 1.6544 1.2011 1.3054 1.3401 1.4614 1.1913 1.1801 1.0502 1.0502 1.0478 1.0519 1.0540 1.0508 1.0624 1.0526 1.0783 1.0609 1.0535 8.1618 9.6958 7.0158 1.0375 1.0355 1.0362 1.0805 1.0634 1.0294 1.0291 1.0965 1.0858 1.0843 1.0992 1.0994 1.0979 1.0986 1.0992 1.0981 1.1045 1.1049 1.1049 1.1054 1.0958 1.0652
irintensity: 0.6458 0.8780 0.3005 0.3128 0.6375 0.4831 0.3028 0.4564 0.6874 3.3430 5.6035 0.7023 1.9939 0.9295 0.3188 0.4864 7.4495 2.1184 1.1626 9.0263 17.9740 5.0615 4.0350 8.0747 10.1052 0.6325 4.3564 10.1228 2.3411 2.6052 6.1619 5.0530 12.1990 134.4106 2.3238 19.9131 13.3539 5.8347 7.2407 1.7055 5.5628 10.0260 9.8335 2.6747 4.2652 1.7848 13.2451 4.8584 17.4837 27.1203 18.4539 33.4955 23.0349 4.2783 10.1391 7.5074 37.8565 4.4322 65.9044 0.6367 1.0318 262.0666 34.6213 8.3936 73.8400 13.6572 60.5127 52.3308 94.5576 66.3363 44.4637 3.8536 1.7281 51.1659 7.1321 39.8950 7.5604 8.9691 22.4906 19.9913 11.6020 55.2698 20.9373 21.0369 13.3325 14.3215 10.0267 8.1724 9.2339 10.6233 8.4863 0.9565 15.7216 4.9088 7.6212 154.1475 139.0619 10.4592 33.4684 33.2249 33.0617 21.4346 32.7716 36.6366 30.1407 23.9574 4.5427 8.0334 5.7252 4.1207 62.9479 46.7683 37.5670 23.5327 24.2764 20.2485 15.0877 12.0944 5.1879 96.7003
temp: 298.150 k
press: 1.00000 atm
elementType: 8 8 8 8 8 6 6 6 6 6 6 6 6 6 6 6 6 6 6 6 1 1 1 1 1 1 1 1 1 1 1 1 1 1 1 1 1 1 1 1 1 1
symmnumber: 1
zpe: 907476.6 jmol-1
zpe.correction: 0.345640 hartree
zpe.thermalcorrener: 0.367161 hartree
zpe.thermalcorrenthalpy: 0.368106 hartree
zpe.thermalcorrgfe: 0.295807 hartree
zpe.sumelectzpe: -959.352330 hartree
zpe.sumelectthermal: -959.330808 hartree
zpe.sumelectthermalent: -959.329864 hartree
zpe.sumelectthermalfe: -959.402162 hartree
dipole: 1.3906 1.9526 4.5091
dipole: 5.1067
quadrupole: -106.5011 -114.8756 -127.0406
quadrupole: -4.5076 -6.8884 1.5337
quadrupole: 9.6380 1.2635 -10.9015 -4.5076 -6.8884 1.5337
hfenergy: -959.6979691 hartree
pointgroup: C01 [X(C15H22O5)]
dipole: 0.4438135 0.8597084 1.7608341 debye
polarizability: 186.094892|4.8698834|166.9788597|0.4082851|5.6190899|156.1862245 unknown
InChI: InChI=1S/C15H22O5/c1-8-6-15(18)7-14(2,3)10(8)9(12(16)19-4)11(15)13(17)20-5/h6,9-11,18H,7H2,1-5H3
charge 0 multiplicity 1
42 atoms
O  -1.342744 -1.845074 -2.156147
O  1.785557 2.483987 0.673153
O  -2.514945 1.244659 0.709681
O  0.63677 2.549905 -1.346519
O  -3.248465 -0.438773 -0.697872
C  0.52933 -1.647082 1.239639
C  1.262821 -0.405624 0.58529
C  -0.478621 -1.319413 -1.109479
C  0.200891 0.720476 0.284505
C  -0.51481 -2.184855 0.192004
C  -0.855368 0.17177 -0.717803
C  1.875252 -0.826903 -0.751317
C  0.945063 -1.295666 -1.625975
C  1.586357 -2.736628 1.559814
C  -0.168411 -1.247795 2.567354
C  0.863098 1.985622 -0.252428
C  -2.301314 0.266519 -0.252932
C  3.35495 -0.694148 -1.008477
C  2.474572 3.736997 0.27835
C  -3.924491 1.433968 1.144141
H  2.020636 -0.007287 1.282762
H  -0.274059 1.014106 1.235743
H  -1.539197 -2.180972 0.612847
H  -0.286711 -3.22581 -0.096623
H  -0.798596 0.770103 -1.652038
H  1.14161 -1.643152 -2.644331
H  2.114129 -3.062749 0.646383
H  2.337845 -2.365154 2.283458
H  1.10024 -3.626241 2.002436
H  -0.565335 -2.148946 3.07101
H  0.543268 -0.759511 3.2606
H  -1.020658 -0.561185 2.412898
H  -2.285082 -1.671035 -1.875156
H  3.942772 -1.296347 -0.287272
H  3.69028 0.355068 -0.886936
H  3.621304 -1.022554 -2.028231
H  1.740376 4.550799 0.154891
H  3.016535 3.59429 -0.671641
H  3.166918 3.949225 1.105026
H  -4.547507 1.724675 0.282569
H  -3.878399 2.236268 1.893183
H  -4.316561 0.499467 1.578239
