program: Gaussian 09
title: 000284609
version: EM64L-G09RevD.01
frameworkgroup: C1[X(C20H14O3)]
method: RPBEPBE
basis: SDD
operation: Freq
keyword: #pfreq=noraman
keyword: PBEPBE/SDD
title: #p freq=noraman PBEPBE/SDD
converged: YES YES NO NO
title: Mulliken charges:
elementType: O O O C C C C C C C C C C C C C C C C C C C C H H H H H H H H H H H H H H
charge: -0.192388 -0.143930 -0.154424 -0.502153 -0.296335 0.432862 -0.421719 0.334020 0.199418 0.176086 -0.533958 0.280577 0.327857 -0.364790 -0.382514 -0.392986 -0.396746 -0.250845 -0.239076 -0.237285 -0.240739 -0.232001 -0.237031 0.309705 0.288240 0.279808 0.246582 0.247823 0.231897 0.229057 0.248371 0.230887 0.228727 0.233712 0.228677 0.231167 0.233447
chargesum: 0.00000
title: Mulliken charges with hydrogens summed into heavy atoms:
elementType: O O O C C C C C C C C C C C C C C C C C C C C
charge: -0.192388 -0.143930 -0.154424 -0.192448 -0.008095 0.432862 -0.141911 0.334020 0.199418 0.176086 -0.287377 0.280577 0.327857 -0.116967 -0.150617 -0.163929 -0.148375 -0.019957 -0.010349 -0.003573 -0.012063 -0.000834 -0.003583
polarizability: 3.31405477e+02 1.55592895e+01 2.55200326e+02 -4.47428493e+00 -1.39255311e+00 1.22286109e+02
1716.lowfreq: -4.5546 -0.0010 -0.0008 -0.0006 0.5934 5.3962 34.4930 39.3903 49.2297
frequency: 34.4660 39.3753 49.2192 58.3112 66.8254 92.1470 113.1956 135.5243 155.5542 204.1255 224.4164 239.5183 273.3230 282.1612 344.3739 376.1173 401.8141 405.0130 411.0842 432.4771 482.5633 490.7739 548.0274 557.0373 579.3792 596.6114 612.3634 616.1117 623.8587 637.7089 665.0859 694.9772 697.6308 701.6675 721.3536 762.7385 768.8833 805.9928 812.2919 823.4938 829.8345 844.9238 849.7626 886.7562 900.0242 920.2471 922.5553 954.7683 973.4518 974.9402 983.9518 988.9972 989.5775 996.9068 997.3330 1012.2438 1027.2010 1039.4098 1045.8084 1085.6590 1091.8133 1095.7733 1127.1499 1174.9954 1175.8412 1195.2046 1202.1119 1215.3281 1217.2159 1236.3198 1267.0322 1278.8012 1304.5450 1312.8692 1323.1012 1344.2860 1359.8190 1377.5967 1384.9955 1434.7728 1438.7528 1485.1750 1488.6781 1573.7313 1580.9817 1588.1326 1610.7489 1612.1019 1643.3835 1697.5216 1766.2533 2985.2517 3005.5834 3125.6850 3126.7917 3129.7958 3135.0270 3141.6900 3145.2398 3147.5154 3150.0946 3151.9118 3158.6139 3167.5343 3170.5725
redmass: 4.8416 3.9546 5.8032 6.3703 6.6209 5.9899 5.2895 14.7565 5.6689 5.1737 4.3113 6.0539 5.0429 5.6964 5.9904 8.0164 2.8541 2.8544 4.2860 6.5803 5.2557 3.6863 5.2128 4.1377 10.0112 6.8647 5.0471 6.3632 3.8138 6.5082 7.2542 1.9923 3.9019 1.7841 3.9418 1.9264 1.9017 6.1046 5.9626 6.1187 1.6724 1.3080 1.2565 1.8804 3.0795 1.4768 1.4858 4.2916 1.5161 1.4627 3.9755 4.8692 4.3953 1.3477 1.3597 2.8682 2.5037 1.9193 2.4286 1.6265 1.6636 7.4012 1.6922 1.0524 1.0537 1.1239 1.1496 1.3635 1.6775 1.7299 1.6197 1.8145 1.5025 1.5084 1.4112 2.4759 2.0947 6.4177 5.2121 2.3138 2.3396 2.2892 2.3708 6.4559 5.6744 6.9188 6.0423 6.0639 6.7430 12.9026 12.7872 1.0820 1.0843 1.0849 1.0850 1.0875 1.0877 1.0919 1.0911 1.0927 1.0917 1.0955 1.0953 1.1017 1.1006
irintensity: 0.2104 0.1302 0.4414 0.6571 0.4162 1.8009 0.2054 2.0679 2.5313 1.3234 0.6181 0.1119 1.5388 1.1111 2.3233 7.9056 1.1737 0.3139 4.6986 1.7001 3.0654 22.9007 14.2271 2.2737 1.9682 18.8244 0.4669 0.4832 1.9240 3.3875 12.1875 35.5979 2.5159 41.9492 10.8276 130.9010 32.6622 71.6067 12.6255 112.1668 20.0266 5.2431 0.7224 16.2229 8.5279 5.1243 3.8810 53.4254 1.0507 1.9393 63.3457 0.7469 0.5671 0.0866 2.1030 1.9443 22.4967 4.4242 15.4521 9.7420 0.7373 202.5990 1.7936 0.0261 0.0268 2.9653 1.1163 3.0436 1.5217 1.4292 6.6000 4.6599 1.6827 8.7211 2.3079 10.9775 22.3443 0.0938 15.0528 2.6406 20.1979 22.8051 10.7424 10.2085 3.5298 1.3575 3.0818 1.3136 30.6460 502.9343 146.0862 5.4092 14.3113 6.3057 5.0076 0.1839 1.6149 13.3361 21.7021 12.0710 1.4178 36.1419 27.9276 24.5354 19.9420
temp: 298.150 k
press: 1.00000 atm
elementType: 8 8 8 6 6 6 6 6 6 6 6 6 6 6 6 6 6 6 6 6 6 6 6 1 1 1 1 1 1 1 1 1 1 1 1 1 1
symmnumber: 1
zpe: 736351.1 jmol-1
zpe.correction: 0.280461 hartree
zpe.thermalcorrener: 0.298559 hartree
zpe.thermalcorrenthalpy: 0.299503 hartree
zpe.thermalcorrgfe: 0.232828 hartree
zpe.sumelectzpe: -994.620229 hartree
zpe.sumelectthermal: -994.602132 hartree
zpe.sumelectthermalent: -994.601187 hartree
zpe.sumelectthermalfe: -994.667862 hartree
dipole: -0.0581 -4.7360 -2.8302
dipole: 5.5175
quadrupole: -111.9174 -140.4307 -141.7439
quadrupole: -2.5086 7.4935 -2.1009
quadrupole: 19.4466 -9.0667 -10.3800 -2.5086 7.4935 -2.1009
hfenergy: -994.9006901 hartree
pointgroup: C01 [X(C20H14O3)]
dipole: -0.0571798 -1.5887143 1.4781256 debye
polarizability: 329.5935631|-20.1201922|251.7827136|-2.3268238|-25.803365|127.5156351 unknown
InChI: InChI=1S/C20H14O3/c21-19-17-12-15(13-7-3-1-4-8-13)11-16(18(17)20(22)23-19)14-9-5-2-6-10-14/h1-12,17-18H
charge 0 multiplicity 1
37 atoms
O  0.65609 3.114931 -1.487485
O  1.863983 1.337772 -2.391099
O  -0.619518 4.454107 -0.057475
C  1.194141 1.311083 0.049237
C  0.002465 2.123145 0.625125
C  1.073921 -0.206292 0.163921
C  -1.334095 1.409868 0.494433
C  -1.417786 0.060812 0.246284
C  1.304295 1.824036 -1.409731
C  -0.051896 3.380249 -0.260401
C  -0.189407 -0.747064 0.192581
C  2.306843 -1.028029 0.236196
C  -2.745258 -0.610002 0.107325
C  3.538654 -0.57496 -0.317751
C  2.295737 -2.295928 0.890343
C  -2.969659 -1.919069 0.61549
C  -3.824281 0.057201 -0.536023
C  4.706165 -1.362219 -0.232036
C  3.460638 -3.083763 0.970493
C  4.675086 -2.620922 0.409993
C  -4.234504 -2.533999 0.496949
C  -5.088285 -0.557043 -0.655659
C  -5.300256 -1.856367 -0.138597
H  2.129697 1.646485 0.541339
H  0.15706 2.447243 1.672039
H  -2.230395 2.013836 0.672221
H  -0.302375 -1.835596 0.159327
H  3.577842 0.371293 -0.866023
H  1.376186 -2.65022 1.369154
H  -2.165257 -2.451145 1.135702
H  -3.659874 1.049017 -0.972134
H  5.637634 -0.997026 -0.678119
H  3.42764 -4.050995 1.484188
H  5.58262 -3.230599 0.477516
H  -4.38963 -3.539205 0.904195
H  -5.902816 -0.028653 -1.163128
H  -6.280206 -2.336382 -0.234987
