program: Gaussian 09
title: 000284596
version: EM64L-G09RevD.01
frameworkgroup: C1[X(C12H18O4)]
method: RPBEPBE
basis: SDD
operation: Freq
keyword: #pfreq=noraman
keyword: PBEPBE/SDD
title: #p freq=noraman PBEPBE/SDD
converged: YES YES NO NO
title: Mulliken charges:
elementType: O O O O C C C C C C C C C C C C H H H H H H H H H H H H H H H H H H
charge: -0.225600 -0.223580 -0.413698 -0.252941 -0.194429 -0.381874 0.389340 -0.486007 -0.521593 0.307463 0.156515 -0.590269 -0.780146 -0.737884 -0.726253 0.201946 0.253118 0.324519 0.223523 0.231736 0.229649 0.222127 0.251755 0.295762 0.259598 0.226358 0.210248 0.214033 0.232673 0.235065 0.241902 0.237281 0.213614 0.376049
chargesum: 0.00000
title: Mulliken charges with hydrogens summed into heavy atoms:
elementType: O O O O C C C C C C C C C C C C
charge: -0.225600 -0.223580 -0.037649 -0.252941 0.058689 -0.057355 0.389340 -0.030748 -0.069817 0.307463 0.156515 -0.042752 -0.083943 -0.056113 -0.033457 0.201946
polarizability: 1.61498861e+02 5.52054773e+00 1.23595448e+02 6.21556021e+00 -1.37547423e+00 1.15821150e+02
1716.lowfreq: -17.5143 -10.1245 -0.0010 -0.0006 -0.0005 12.5504 32.4833 49.7198 77.0199
frequency: 31.9421 49.6653 77.0180 96.3939 119.3768 164.9502 185.1672 197.4138 230.3944 244.3868 252.3049 265.2479 295.3723 307.0984 325.0608 332.9292 357.9420 365.5763 415.6061 469.1553 490.1565 507.7191 538.4088 565.9429 572.3381 621.0869 638.5501 649.5781 712.5223 742.9612 799.5014 824.3451 848.9668 861.6305 886.1533 897.9116 912.6310 934.2687 939.5168 966.5325 967.7611 977.2315 995.5977 1010.4868 1050.8559 1059.8186 1084.6458 1117.8212 1125.1330 1146.3090 1172.4820 1174.6954 1201.6739 1211.9290 1222.9594 1239.5300 1259.2554 1264.2283 1280.1368 1289.5876 1311.3127 1314.4262 1327.8352 1363.5323 1381.2593 1385.1787 1396.8396 1422.9777 1451.7484 1465.5529 1469.9223 1470.1242 1474.8108 1482.8967 1489.7867 1498.9928 1660.3462 1671.8286 2980.6774 2985.0787 2987.2668 2993.2100 3000.4000 3014.3824 3031.2230 3044.4741 3052.7256 3059.5838 3071.8865 3081.5706 3083.2320 3089.1857 3093.8016 3099.2251 3100.4866 3512.7808
redmass: 6.0275 4.6958 9.7320 4.4211 3.4600 3.2833 1.6668 1.4837 1.1609 1.1609 2.1139 4.0081 2.9774 3.9422 2.8383 2.8507 2.7612 2.6343 2.5788 3.6958 2.1219 3.1211 3.2153 4.0081 4.8654 5.0888 1.4623 2.8909 3.3826 2.9023 3.5780 3.4910 4.2523 4.5884 1.9601 3.2806 2.1161 1.5556 1.7291 2.0883 1.7932 1.7062 1.4865 1.7580 2.2075 2.5476 2.0057 3.1217 1.6928 2.1792 1.5055 1.5211 1.7550 2.5990 1.6628 1.6393 2.3126 1.8639 1.6160 1.6053 1.5563 1.4516 1.4638 1.9258 1.2317 1.2338 1.2125 1.0856 1.0509 1.0531 1.0720 1.0628 1.0595 1.0699 1.0557 1.0684 8.1206 12.1870 1.0382 1.0607 1.0357 1.0365 1.0621 1.0705 1.0816 1.0872 1.0964 1.0962 1.0978 1.1011 1.0995 1.0996 1.0995 1.0995 1.0993 1.0639
irintensity: 2.1365 1.1860 0.6897 0.1032 1.3975 1.2677 2.7301 2.3846 0.1507 0.2221 0.1304 3.0077 0.4945 5.7146 0.5687 3.4793 0.5517 0.9351 3.7609 3.3876 21.2022 7.2310 18.5080 37.4099 4.5180 6.4350 122.9914 3.0629 0.9519 1.0056 2.6107 8.7875 11.0117 18.2104 1.5889 33.0496 10.7871 3.1903 5.4569 91.4938 22.1639 17.9452 0.7267 9.4081 336.2752 35.8012 7.1622 106.0774 17.6316 27.6469 30.5649 9.4982 1.9099 32.1204 0.3599 1.6973 46.4996 5.0668 6.0949 4.4719 9.2875 5.1288 3.3473 75.1356 31.2039 25.1521 18.8154 35.6577 2.3087 4.7706 8.2950 5.4896 11.8676 12.7715 21.4946 5.4916 147.6592 308.0237 30.0984 20.8912 13.9315 15.2713 19.3568 16.3057 18.7990 11.2759 25.5672 5.8770 44.1646 25.6497 26.4666 11.9935 12.8659 28.1850 33.3621 25.4170
temp: 298.150 k
press: 1.00000 atm
elementType: 8 8 8 8 6 6 6 6 6 6 6 6 6 6 6 6 1 1 1 1 1 1 1 1 1 1 1 1 1 1 1 1 1 1
symmnumber: 1
zpe: 740885.7 jmol-1
zpe.correction: 0.282188 hartree
zpe.thermalcorrener: 0.298303 hartree
zpe.thermalcorrenthalpy: 0.299247 hartree
zpe.thermalcorrgfe: 0.239258 hartree
zpe.sumelectzpe: -767.754174 hartree
zpe.sumelectthermal: -767.738060 hartree
zpe.sumelectthermalent: -767.737115 hartree
zpe.sumelectthermalfe: -767.797105 hartree
dipole: 1.8958 4.0594 1.4856
dipole: 4.7202
quadrupole: -84.7651 -99.6779 -99.8308
quadrupole: 1.6919 2.8099 -5.0783
quadrupole: 9.9929 -4.9199 -5.0729 1.6919 2.8099 -5.0783
hfenergy: -768.0363626 hartree
pointgroup: C01 [X(C12H18O4)]
dipole: 0.678071 1.5957474 0.665171 debye
polarizability: 160.7591602|6.4925399|124.0700359|7.6191561|-0.6883658|116.0862624 unknown
InChI: InChI=1S/C12H18O4/c1-11(2)7-4-5-12(3,6-8(13)14)9(7)10(15)16-11/h7,9,13H,4-6H2,1-3H3
charge 0 multiplicity 1
34 atoms
O  1.797827 -1.245012 -0.648004
O  -0.384147 -1.883863 -1.0593
O  -4.126094 -0.94475 -0.574187
O  -2.755457 -0.936761 1.291073
C  1.451307 0.773995 0.659846
C  0.098486 0.005191 0.52922
C  -0.949419 1.054758 0.018386
C  1.302542 2.027571 -0.26919
C  -0.080855 1.895479 -0.965699
C  2.532362 -0.298054 0.287523
C  0.409768 -1.131215 -0.462643
C  -2.181578 0.452856 -0.697679
C  -1.410457 1.931458 1.215328
C  3.761918 0.189612 -0.485716
C  2.938183 -1.12495 1.524175
C  -2.994253 -0.520885 0.13422
H  1.636721 1.095712 1.699361
H  -0.255969 -0.460132 1.465964
H  2.118222 2.108168 -1.006005
H  1.33896 2.947522 0.340918
H  -0.537519 2.876997 -1.188102
H  0.021402 1.351242 -1.925435
H  -2.858323 1.266485 -1.024891
H  -1.885479 -0.094182 -1.61067
H  -1.947986 1.32123 1.960786
H  -0.554219 2.413421 1.719776
H  -2.087899 2.732749 0.864624
H  4.279937 0.988056 0.076014
H  3.486239 0.57814 -1.479844
H  4.468257 -0.645006 -0.636138
H  3.495562 -2.024284 1.211899
H  2.053568 -1.450951 2.099729
H  3.584285 -0.525222 2.191053
H  -4.615293 -1.619378 -0.029089
