program: Gaussian 09
title: 000284656
version: EM64L-G09RevD.01
frameworkgroup: C1[X(C17H15Br2NO3S)]
method: RPBEPBE
basis: SDD
operation: Freq
keyword: #p
keyword: freq=noraman
keyword: PBEPBE/SDD
title: #p freq=noraman PBEPBE/SDD
converged: YES YES NO NO
title: Mulliken charges:
elementType: Br Br S O O O N C C C C C C C C C C C C C C C C C H H H H H H H H H H H H H H H
charge: 0.091251 0.088639 0.946532 -0.512162 -0.520922 -0.141482 -0.533154 -0.367639 -0.401766 0.317035 -0.626679 0.229516 0.229530 -0.020993 -0.334905 -0.339135 -0.217272 -0.254970 -0.213547 -0.244738 -0.392705 -0.337037 0.451890 -0.798910 0.243074 0.292292 0.285137 0.264951 0.300138 0.268866 0.288155 0.279730 0.238460 0.240655 0.245052 0.248254 0.244729 0.228285 0.235849
chargesum: 0.00000
title: Mulliken charges with hydrogens summed into heavy atoms:
elementType: Br Br S O O O N C C C C C C C C C C C C C C C C C
charge: 0.091251 0.088639 0.946532 -0.512162 -0.520922 -0.141482 -0.533154 0.167727 0.148321 0.317035 -0.626679 0.229516 0.229530 -0.020993 -0.034767 -0.070269 0.021188 0.033185 0.066183 -0.004083 -0.147653 -0.088784 0.451890 -0.090047
polarizability: 2.77968796e+02 1.57719967e+01 2.54596684e+02 -3.97269440e+00 -1.83394858e+00 2.38716202e+02
1716.lowfreq: -18.1036 -15.2801 -10.1496 -4.2933 -0.0014 0.0012 0.0014 14.3111 20.1818
frequency: -13.6103 12.9728 19.6620 24.6276 38.8908 43.7931 84.6060 100.2618 103.1352 120.9467 129.9799 142.4137 150.8008 157.6846 189.9212 206.8856 219.4230 227.1222 242.0734 255.9817 283.6416 302.8399 314.4499 318.4821 361.9756 379.8314 397.2954 402.7752 405.4008 439.0693 466.1077 488.7795 504.8650 529.3329 557.5863 586.8468 597.6190 601.7446 619.8527 660.1187 703.6663 714.0578 716.5600 769.6032 774.2786 786.4803 805.6496 817.2108 824.4583 846.1711 866.4322 889.3276 925.7573 935.1233 960.9045 962.7196 969.1980 982.1652 986.0777 995.3872 997.0838 1030.5622 1048.5812 1049.5973 1060.6331 1075.6644 1100.1680 1120.7203 1127.5518 1177.0541 1186.5669 1201.2940 1218.4768 1230.6993 1242.0149 1262.1487 1289.9594 1298.6613 1332.4390 1358.8480 1367.5057 1380.9192 1390.7671 1399.8199 1431.5364 1444.2763 1457.3507 1469.1879 1471.8557 1475.7114 1485.6142 1568.6507 1584.1902 1592.6063 1594.8239 1600.7656 2954.5308 2983.5822 3011.6075 3064.2337 3071.7764 3085.9453 3094.9981 3136.8800 3139.2304 3140.7791 3148.4219 3158.8511 3162.9011 3166.2399 3171.6625
redmass: 4.1919 7.4770 6.8107 8.3343 1.0632 7.4064 4.8836 6.0809 10.3027 7.0174 9.3930 9.3643 6.3692 13.0324 12.7622 3.2702 8.5547 8.7734 5.6123 7.2095 5.3750 2.7908 4.4696 5.7071 3.9599 4.2292 5.7781 5.9090 3.4336 5.3891 6.3022 4.1658 3.5641 4.2645 6.3015 6.1095 5.8991 4.6468 6.9513 3.7389 3.3076 4.3931 5.2696 2.0501 4.6073 2.5484 9.6560 3.6701 1.4171 1.2491 2.0383 1.5776 4.8539 4.9018 1.3343 1.4500 3.7086 1.4042 1.9333 2.2708 1.4757 3.0944 2.3886 1.6177 2.7798 2.2127 2.1199 1.3021 4.7619 1.0643 1.1472 1.9530 3.0313 1.1559 2.6239 1.4773 1.6328 1.2659 1.3862 1.3442 10.3209 4.6683 3.1047 1.2772 2.2944 1.0935 2.1628 1.0677 2.1602 1.1262 1.1377 6.5006 7.6722 6.0083 6.7494 8.7510 1.0676 1.0381 1.0627 1.0963 1.0952 1.0985 1.0993 1.0863 1.0892 1.0894 1.0901 1.0952 1.0961 1.0968 1.1007
irintensity: 0.4777 2.4872 0.9708 0.2268 0.6544 1.1120 0.1001 0.4996 1.1135 1.8538 1.7766 0.3643 0.3823 2.3544 0.1984 4.0848 6.7101 5.5177 4.0000 6.8538 4.1618 1.0098 10.2734 0.2445 8.4382 3.6041 11.9740 18.4589 5.3924 25.6538 43.3501 41.1255 105.0824 1.6131 45.3346 14.7673 37.6171 66.8190 1.4834 27.9831 2.4508 4.9416 10.0707 33.8075 6.7961 73.3492 69.7098 70.2519 22.3183 3.0141 54.5022 0.7629 25.8981 19.2039 2.6913 3.0969 56.2750 0.5098 1.5744 3.4680 2.4841 23.0055 25.4368 12.3596 24.3591 15.0708 26.6101 5.1704 3.5708 0.4403 7.9333 44.6564 6.1611 17.5869 32.0600 15.5300 40.2998 1.9256 17.2560 2.2117 5.9887 2.1433 11.4231 17.1693 33.8450 14.0517 15.5999 13.7172 22.9389 13.8878 26.3976 1.4481 81.8033 16.6776 1.0865 47.3970 60.5843 20.6088 8.0235 16.1536 2.6217 4.4355 15.8533 3.1643 11.8812 4.4607 4.7205 0.7057 0.9917 11.0156 21.0337
temp: 298.150 k
press: 1.00000 atm
elementType: 35 35 16 8 8 8 7 6 6 6 6 6 6 6 6 6 6 6 6 6 6 6 6 6 1 1 1 1 1 1 1 1 1 1 1 1 1 1 1
symmnumber: 1
zpe: 732933.8 jmol-1
zpe.correction: 0.279160 hartree
zpe.thermalcorrener: 0.302299 hartree
zpe.thermalcorrenthalpy: 0.303244 hartree
zpe.thermalcorrgfe: 0.222987 hartree
zpe.sumelectzpe: -1360.302875 hartree
zpe.sumelectthermal: -1360.279735 hartree
zpe.sumelectthermalent: -1360.278791 hartree
zpe.sumelectthermalfe: -1360.359048 hartree
dipole: 2.1969 2.9771 -3.4327
dipole: 5.0471
quadrupole: -156.2147 -153.2896 -176.5930
quadrupole: -5.6245 -25.7338 0.8104
quadrupole: 5.8177 8.7429 -14.5605 -5.6245 -25.7338 0.8104
hfenergy: -1360.5820346 hartree
pointgroup: C01 [X(C17H15Br2N1O3S1)]
dipole: 0.6588303 1.8000205 -0.5184357 debye
polarizability: 268.38013|17.5750108|259.6037702|9.0046571|10.2858936|243.2977815 unknown
InChI: InChI=1S/C17H15Br2NO3S/c1-12-6-8-13(9-7-12)24(22,23)20-11-10-17(18,19)16(21)14-4-2-3-5-15(14)20/h2-9H,10-11H2,1H3
charge 0 multiplicity 1
39 atoms
Br -2.002103 -2.880948 -1.162749
Br -4.584871 -0.907392 -1.773318
S  0.812894 -0.970922 2.030805
O  0.590976 -2.563136 2.267209
O  1.268486 -0.033276 3.287828
O  -1.610816 0.040017 -2.584611
N  -0.803414 -0.433727 1.241093
C  -1.98639 -1.186181 1.715729
C  -3.166465 -0.965983 0.741421
C  -0.923791 0.931638 0.831363
C  -2.812374 -1.073501 -0.749679
C  -1.471195 1.168569 -0.468327
C  -1.902536 0.044112 -1.364311
C  1.998331 -0.638559 0.608305
C  -0.467862 2.025304 1.609575
C  -1.540402 2.491276 -0.971271
C  -0.550195 3.338795 1.09443
C  2.985111 0.338794 0.80009
C  1.876475 -1.408742 -0.560301
C  -1.088863 3.576391 -0.191586
C  3.896917 0.560642 -0.256825
C  2.797384 -1.162654 -1.599381
C  3.814655 -0.17754 -1.466081
C  4.780979 0.083004 -2.60615
H  -2.316288 -0.866269 2.726859
H  -1.704871 -2.251365 1.757426
H  -3.947901 -1.707899 0.980821
H  -3.60893 0.035824 0.89898
H  -0.037382 1.836457 2.598113
H  -1.94131 2.647896 -1.978227
H  3.038696 0.892656 1.742752
H  1.091397 -2.164638 -0.661761
H  -0.194646 4.177605 1.702822
H  -1.150609 4.596119 -0.584853
H  4.681085 1.316506 -0.137193
H  2.721127 -1.740732 -2.527251
H  4.273333 0.606192 -3.43881
H  5.630379 0.709285 -2.285811
H  5.185189 -0.86042 -3.015028
