program: Gaussian 09
title: 000284595
version: EM64L-G09RevD.01
frameworkgroup: C1[X(C14H22O4)]
method: RPBEPBE
basis: SDD
operation: Freq
keyword: #pfreq=noraman
keyword: PBEPBE/SDD
title: #p freq=noraman PBEPBE/SDD
converged: YES YES NO NO
title: Mulliken charges:
elementType: O O O O C C C C C C C C C C C C C C H H H H H H H H H H H H H H H H H H H H H H
charge: -0.227492 -0.222075 -0.266014 -0.266216 -0.192883 -0.383293 0.398366 -0.488035 -0.522942 0.307775 0.155563 -0.621602 -0.783551 -0.738701 -0.726832 0.279148 -0.260744 -0.666000 0.251205 0.323818 0.223340 0.231039 0.228509 0.220859 0.287455 0.243992 0.262151 0.224280 0.208638 0.232978 0.213660 0.234210 0.240954 0.212886 0.237265 0.224812 0.235983 0.215910 0.246177 0.225408
chargesum: 0.00000
title: Mulliken charges with hydrogens summed into heavy atoms:
elementType: O O O O C C C C C C C C C C C C C C
charge: -0.227492 -0.222075 -0.266014 -0.266216 0.058322 -0.059475 0.398366 -0.033655 -0.073574 0.307775 0.155563 -0.090155 -0.088482 -0.057853 -0.035728 0.279148 0.200051 0.021494
polarizability: 1.97673964e+02 4.36815877e+00 1.41769182e+02 6.58053956e+00 -7.93441577e-01 1.32338700e+02
1716.lowfreq: -7.7727 -0.0008 -0.0004 0.0005 4.5864 11.4844 23.2389 38.9005 54.2834
frequency: 22.4530 38.7654 54.1781 78.9015 93.4675 97.9568 112.2178 154.2794 188.6934 202.3065 207.6158 229.8187 245.7265 253.2012 262.1609 268.5090 301.9892 319.1095 328.7809 331.4652 359.9708 369.9607 403.3344 429.1029 470.1111 503.7408 533.0111 557.3321 572.6854 611.7152 628.1914 663.4329 711.2654 735.0254 784.4246 800.1303 819.0829 830.2191 857.8308 882.8163 889.4275 902.0461 913.6637 936.0972 941.0231 966.9286 969.8171 979.1604 993.9391 1007.9781 1020.3151 1058.1369 1081.9707 1094.9416 1112.5816 1120.7784 1123.8557 1150.1356 1157.1950 1173.6517 1175.8682 1204.5627 1213.1893 1222.0000 1239.9889 1259.5764 1278.7514 1279.8849 1288.6717 1308.0337 1314.0207 1326.4531 1339.2910 1360.3168 1382.4803 1384.2979 1389.7662 1397.9854 1431.9514 1452.3931 1457.8263 1463.4597 1464.7178 1470.3658 1470.9540 1475.6475 1482.7614 1484.8889 1492.8518 1502.8437 1634.4491 1673.6691 2980.8870 2985.2584 2985.3166 2991.3054 2994.8180 2997.1458 3013.7729 3030.8364 3032.0224 3043.1102 3053.1206 3061.6942 3070.8315 3080.9807 3081.5112 3086.1824 3088.6467 3092.5457 3094.7240 3097.0998 3105.5634 3119.1796
redmass: 4.8583 3.7765 3.2139 4.3851 5.9114 4.7101 2.9885 2.7546 2.0432 1.5158 1.3733 1.1582 1.3300 1.7082 2.8157 2.4112 2.9813 2.2538 3.5865 2.7144 3.2564 2.2151 3.0246 2.6563 3.9899 3.3222 3.2168 3.5890 4.7863 4.3756 3.4447 3.9631 3.1666 2.8998 2.3762 2.0282 2.5350 3.1272 3.9882 2.7494 2.3362 3.3003 2.0809 1.5475 1.7449 1.8121 2.0204 1.6791 1.4997 1.7850 2.6795 2.7133 2.0047 2.1661 2.3745 3.8146 1.6874 1.9300 1.6596 1.3939 1.8402 2.2436 2.0390 1.9068 1.6878 2.5211 1.1293 1.6004 1.6527 1.4394 1.5105 1.4859 1.5156 1.4209 1.2396 1.2049 1.2379 1.2136 1.0869 1.0513 1.0928 1.0444 1.0569 1.0624 1.0704 1.0577 1.0753 1.0517 1.0565 1.0651 8.5743 12.3462 1.0374 1.0600 1.0371 1.0360 1.0368 1.0638 1.0700 1.0816 1.0594 1.0871 1.0964 1.0950 1.0980 1.1008 1.0995 1.0972 1.0996 1.1029 1.0991 1.0995 1.0991 1.1066
irintensity: 2.4956 1.6064 0.6979 0.4168 1.6574 0.5109 1.2365 0.1822 4.1748 4.7071 2.7941 0.4406 0.0761 0.9766 3.2427 0.7649 1.2867 0.6420 20.9996 7.0007 0.7514 0.5725 3.0003 1.3999 0.6195 3.0438 10.7790 1.4141 5.0361 1.8139 1.3484 7.9831 0.4830 2.7887 5.4139 4.4058 4.0718 5.8001 28.6562 13.8688 15.4516 27.5643 14.7476 5.1871 7.3400 1.8839 45.0791 25.8137 6.3522 4.5017 80.2522 98.1858 47.9111 57.6310 305.9926 34.0748 30.0548 53.2628 13.0250 47.7783 33.5407 24.7351 24.2455 10.8184 2.1695 38.5258 4.6068 4.6349 6.2972 7.7882 9.8230 4.8460 53.1370 17.8119 28.0674 27.9404 22.9431 19.9947 31.7466 2.6064 12.4661 13.4711 3.9111 5.0605 5.6536 22.2285 5.9715 12.3234 20.0061 7.0343 117.6299 296.8478 30.7174 27.5177 7.5377 23.3191 16.7499 19.8158 17.3804 15.8793 27.6744 13.3646 28.8727 5.4223 47.4947 27.0020 27.7259 37.8634 9.2559 1.9638 11.4234 34.8088 29.9644 34.3756
temp: 298.150 k
press: 1.00000 atm
elementType: 8 8 8 8 6 6 6 6 6 6 6 6 6 6 6 6 6 6 1 1 1 1 1 1 1 1 1 1 1 1 1 1 1 1 1 1 1 1 1 1
symmnumber: 1
zpe: 887145.2 jmol-1
zpe.correction: 0.337896 hartree
zpe.thermalcorrener: 0.356949 hartree
zpe.thermalcorrenthalpy: 0.357894 hartree
zpe.thermalcorrgfe: 0.290623 hartree
zpe.sumelectzpe: -846.194704 hartree
zpe.sumelectthermal: -846.175651 hartree
zpe.sumelectthermalent: -846.174707 hartree
zpe.sumelectthermalfe: -846.241978 hartree
dipole: 1.4118 3.3958 1.6811
dipole: 4.0436
quadrupole: -88.8033 -111.1454 -112.4243
quadrupole: 3.8656 4.1226 -5.3369
quadrupole: 15.3210 -7.0210 -8.3000 3.8656 4.1226 -5.3369
hfenergy: -846.5326002 hartree
pointgroup: C01 [X(C14H22O4)]
dipole: 0.4867568 1.3623068 0.6618273 debye
polarizability: 196.8283706|6.4725659|142.1468347|8.4883518|-0.4635988|132.8066406 unknown
InChI: InChI=1S/C14H22O4/c1-5-17-10(15)8-14(4)7-6-9-11(14)12(16)18-13(9,2)3/h9,11H,5-8H2,1-4H3
charge 0 multiplicity 1
40 atoms
O  2.21051 -1.339255 -0.511735
O  -0.016713 -1.679566 -1.022903
O  -3.541562 -0.290781 -0.831312
O  -2.338534 -0.354231 1.162145
C  2.087465 0.739976 0.743069
C  0.647914 0.167078 0.550653
C  -0.213591 1.340766 -0.030769
C  2.164429 1.98813 -0.201672
C  0.816157 2.035083 -0.97335
C  3.025082 -0.478813 0.440398
C  0.843697 -1.027126 -0.401681
C  -1.478134 0.904252 -0.808837
C  -0.611302 2.29609 1.128294
C  4.343373 -0.181502 -0.281295
C  3.258108 -1.323157 1.709646
C  -2.452913 0.037549 -0.024583
C  -4.574254 -1.192762 -0.233719
C  -5.633817 -0.381611 0.517823
H  2.263451 1.049427 1.787927
H  0.182137 -0.221095 1.473822
H  3.023417 1.94969 -0.891476
H  2.290223 2.902803 0.404702
H  0.512689 3.065813 -1.232083
H  0.894374 1.464236 -1.919874
H  -1.212103 0.33328 -1.715823
H  -2.025045 1.802793 -1.156644
H  -1.279103 1.783863 1.84119
H  0.273329 2.655446 1.683837
H  -1.139471 3.182749 0.729656
H  4.16666 0.214846 -1.294448
H  4.938411 0.554978 0.28878
H  4.936318 -1.107108 -0.380839
H  3.706219 -2.294998 1.441195
H  3.945409 -0.797524 2.397782
H  2.31156 -1.515695 2.24551
H  -4.995285 -1.717292 -1.106246
H  -4.066648 -1.91028 0.434067
H  -6.432764 -1.055298 0.880078
H  -5.190624 0.126691 1.390652
H  -6.09307 0.374154 -0.14274
