program: Gaussian 09
title: 000284564
version: EM64L-G09RevD.01
frameworkgroup: C1[X(C9H8F3NO2)]
method: RPBEPBE
basis: SDD
operation: Freq
keyword: #p
keyword: freq=noraman
keyword: PBEPBE/SDD
title: #p freq=noraman PBEPBE/SDD
converged: NO YES NO NO
title: Mulliken charges:
elementType: F F F O O N C C C C C C C C C H H H H H H H H
charge: -0.147022 -0.181229 -0.180479 -0.449167 -0.256516 -0.395598 0.157353 0.368099 -0.496405 0.283927 -0.329014 -0.335667 0.234241 -0.638822 0.100624 0.299774 0.248711 0.276728 0.340505 0.240188 0.235052 0.240270 0.384447
chargesum: 0.00000
title: Mulliken charges with hydrogens summed into heavy atoms:
elementType: F F F O O N C C C C C C C C C
charge: -0.147022 -0.181229 -0.180479 -0.064720 -0.256516 -0.055092 0.157353 0.368099 -0.196631 0.283927 -0.080303 -0.058939 0.234241 0.076687 0.100624
polarizability: 1.82170418e+02 2.01759020e+01 1.27028582e+02 8.73681246e-03 3.99090039e-02 5.67977790e+01
1716.lowfreq: -0.0007 -0.0005 -0.0001 3.8012 8.8931 10.2539 31.0132 60.4598 77.4927
frequency: 30.4862 60.4482 77.4824 109.6394 126.3148 152.8695 164.4043 188.1047 247.1029 252.2755 286.7712 325.6407 345.4705 349.1802 423.5775 447.4156 458.6967 487.8058 509.7862 552.6129 560.7939 590.7406 607.3125 620.9687 681.1049 711.1011 734.7545 754.5136 834.8581 836.5088 930.2409 969.4711 988.3959 989.3216 1015.4034 1047.7459 1076.2465 1119.4419 1126.3424 1151.3053 1186.9175 1244.9175 1268.0347 1326.7012 1354.7239 1386.4797 1441.3024 1455.8949 1473.3284 1484.1599 1500.9194 1538.1353 1587.0602 1633.5917 1647.8368 2964.9423 3036.3776 3108.8515 3163.7266 3168.3897 3183.8167 3534.3929 3575.5858
redmass: 11.5650 10.5572 4.3044 3.6264 10.2854 3.6616 4.5037 1.1275 4.8130 5.8952 10.6556 7.9370 4.8968 6.2633 3.2817 1.6447 8.9699 8.3826 3.4784 2.3141 5.2630 6.2334 1.7486 7.0164 7.0136 4.9473 4.6819 4.5349 1.5753 6.9290 3.8072 1.8504 7.5267 1.3554 5.4721 3.7337 3.0154 1.2851 1.6317 1.7029 1.4474 3.3172 1.5116 1.9320 3.1715 5.3021 1.9994 1.9283 1.0408 1.6007 1.2643 3.5982 2.8371 7.2383 7.9590 1.0372 1.1014 1.0972 1.0877 1.0922 1.0967 1.0642 1.0778
irintensity: 1.1235 0.2527 1.7794 0.0106 0.3510 0.0076 3.4121 0.8192 0.1026 1.4696 0.3952 6.3578 0.1646 4.0711 26.7619 59.7816 2.2974 8.7586 4.6662 44.5618 78.0115 11.6448 68.2546 12.7728 10.9115 57.0247 21.3578 12.1779 31.1665 51.1771 269.4093 24.7568 1.7299 1.2588 59.2706 368.8431 87.9735 1.8876 9.1754 260.6902 18.9997 197.3067 114.6155 31.2883 129.1877 5.0528 4.7655 7.6804 15.7010 10.4352 13.4085 214.2616 59.0228 673.8114 111.4380 75.1622 36.0467 17.0648 2.9930 1.7858 7.5941 56.2356 97.4102
temp: 298.150 k
press: 1.00000 atm
elementType: 9 9 9 8 8 7 6 6 6 6 6 6 6 6 6 1 1 1 1 1 1 1 1
symmnumber: 1
zpe: 419941.5 jmol-1
zpe.correction: 0.159947 hartree
zpe.thermalcorrener: 0.174111 hartree
zpe.thermalcorrenthalpy: 0.175055 hartree
zpe.thermalcorrgfe: 0.118169 hartree
zpe.sumelectzpe: -851.409081 hartree
zpe.sumelectthermal: -851.394918 hartree
zpe.sumelectthermalent: -851.393973 hartree
zpe.sumelectthermalfe: -851.450860 hartree
dipole: 1.6625 5.6357 -0.0086
dipole: 5.8758
quadrupole: -76.3731 -83.2944 -89.2333
quadrupole: 4.2625 -0.0347 0.0037
quadrupole: 6.5938 -0.3275 -6.2664 4.2625 -0.0347 0.0037
hfenergy: -851.5690286 hartree
pointgroup: C01 [X(C9H8F3N1O2)]
dipole: -0.635145 2.2201079 0.108686 debye
dipolederiv: -0.3525462 0.0279044 0.0007344 0.0271441 -0.82892 -0.0210663 0.0003227 -0.0226364 -0.2643077 -0.6624332 -0.2191427 0.2788821 -0.1358762 -0.3891374 -0.0008425 0.2708821 0.0716481 -0.6271968 -0.6679296 -0.2004664 -0.2958613 -0.1145557 -0.3841396 0.0208687 -0.283195 -0.0533789 -0.6273771 -1.1517804 -0.4185404 -0.0115282 -0.6910035 -0.62943 -0.0019591 -0.0232392 -0.0044323 -0.4316211 -0.9484631 0.3238097 0.0202777 0.4511584 -1.0211425 -0.034623 0.0260922 -0.0337253 -0.3376703 -1.4830035 0.6971371 0.0409951 0.3568381 -0.4918076 -0.0069017 0.0234882 -0.0092528 -0.4282341 -0.7305964 -0.2199084 -0.0045726 0.2900705 -0.5441034 -0.016552 0.0191482 -0.0099287 -0.2450893 1.5458534 -0.7191079 -0.0458806 -0.2487719 0.2519854 0.0057406 -0.0256516 0.0104196 0.1809133 0.6723781 0.193199 0.0014411 0.0993811 0.0225181 0.0022564 -0.0029739 0.001303 -0.0492933 -1.1392669 0.1721352 0.0184405 0.230562 -0.4987576 -0.0225861 0.020705 -0.021763 -0.0419242 -0.7649711 0.3360718 0.0202434 -0.2965447 0.1128064 0.0181108 -0.007106 0.0112042 -0.2304924 0.4391556 -0.2574337 -0.0163186 -0.3351768 0.3812117 0.0230175 -0.0197876 0.0223107 -0.0706819 1.7072724 0.6086555 0.0255041 0.4576005 1.7474347 0.0058677 0.0216294 0.0092833 1.5128579 0.248313 -0.0962845 -0.0038264 -0.3699125 0.5956812 0.0189985 -0.0156964 0.0156858 0.2635932 2.4362905 -0.2200893 -0.0313704 -0.1616029 1.3561768 0.0514029 -0.0291247 0.0520005 0.2332377 0.1445719 0.033389 0.0015555 0.0034398 0.0575398 -0.0042184 0.000128 -0.0045942 0.152508 0.064538 0.0550117 0.0033455 0.0474357 -0.0719233 -0.0108081 0.0032713 -0.0109931 0.1645781 0.0709562 -0.0728071 -0.0023728 -0.0681193 0.0533615 -0.0036091 -0.0022448 -0.0034932 0.1517116 0.2573341 -0.0053 0.000633 0.1119381 0.1143548 -0.0100165 0.0068342 -0.0101178 0.3095498 0.0861277 -0.0779568 -0.0971682 0.0946339 -0.055883 -0.0637798 -0.0110726 -0.1165816 -0.0785131 -0.1466126 0.0593868 0.0058863 -0.0238198 0.0799184 -0.0019257 0.0023018 -0.0029634 0.129854 0.088652 -0.0832467 0.0860662 0.0946534 -0.0719358 0.0626075 0.0160295 0.1190295 -0.0647062 0.2861599 0.0835838 0.0048941 0.1805276 0.2141916 -0.0099824 0.0092589 -0.0090241 0.398304 unknown
polarizability: 181.8115554|-20.5662611|127.2208615|-2.1375371|3.3044403|56.9643615 unknown
InChI: InChI=1S/C9H8F3NO2/c1-13-7-3-2-5(8(14)15)4-6(7)9(10,11)12/h2-4,13-14H,1H3
charge 0 multiplicity 1
23 atoms
F  -1.222024 -2.754988 -0.08594
F  -2.580542 -1.375496 1.102005
F  -2.588005 -1.288434 -1.154516
O  4.088386 0.741521 0.006991
O  3.533213 -1.513899 -0.087313
N  -2.298192 1.411653 0.100032
C  -0.627808 -0.400081 0.003336
C  -0.982533 0.999855 0.067968
C  0.719237 -0.796959 -0.026937
C  1.760579 0.160334 0.004655
C  0.086622 1.951648 0.098463
C  1.42311 1.539767 0.067616
C  -1.699048 -1.437952 -0.033386
C  -2.711064 2.815431 0.168085
C  3.157182 -0.315737 -0.030118
H  0.983664 -1.857734 -0.075945
H  -0.145257 3.018332 0.147172
H  2.227982 2.279795 0.091982
H  -3.034432 0.706707 0.079633
H  -2.334537 3.309702 1.084673
H  -3.811256 2.862154 0.183479
H  -2.356218 3.390464 -0.709127
H  5.002943 0.352218 -0.019711
