program: Gaussian 09
title: 000284585
version: EM64L-G09RevD.01
frameworkgroup: C1[X(C13H18O5)]
method: RPBEPBE
basis: SDD
operation: Freq
keyword: #pfreq=noraman
keyword: PBEPBE/SDD
title: #p freq=noraman PBEPBE/SDD
converged: NO YES NO NO
title: Mulliken charges:
elementType: O O O O O C C C C C C C C C C C C C H H H H H H H H H H H H H H H H H H
charge: -0.179650 -0.407310 -0.422947 -0.233624 -0.213128 0.370256 0.409993 -0.368120 -0.591901 -0.225109 -0.280753 -0.595558 0.102448 -0.762593 -0.780704 -0.777029 0.103809 0.125249 0.299921 0.251323 0.219066 0.320838 0.321080 0.265356 0.251693 0.223233 0.229119 0.214741 0.216392 0.255554 0.216099 0.217398 0.231412 0.225008 0.378540 0.389900
chargesum: 0.00000
title: Mulliken charges with hydrogens summed into heavy atoms:
elementType: O O O O O C C C C C C C C C C C C C
charge: -0.179650 -0.028770 -0.033047 -0.233624 -0.213128 0.370256 0.409993 -0.068199 -0.121512 0.095729 0.040327 -0.078509 0.102448 -0.095500 -0.092659 -0.103212 0.103809 0.125249
polarizability: 1.50167182e+02 2.65138118e+00 1.43448793e+02 2.98695835e+00 -1.86627439e+00 1.43322093e+02
1716.lowfreq: -14.1236 -10.0257 -0.0009 -0.0008 -0.0003 6.0330 40.0807 46.5707 64.5510
frequency: 39.8172 46.4937 64.5483 87.4771 108.6358 119.9170 135.8461 170.1133 202.2406 209.4261 231.2950 237.2912 254.7126 269.9443 288.8873 304.1403 317.2853 340.4096 377.7539 397.2413 418.3618 438.7519 464.6673 498.0224 509.4902 539.1429 556.6109 570.6961 583.1406 606.5847 619.9776 658.4578 693.5531 728.5803 784.9368 816.3031 832.2380 861.6042 882.5242 895.9891 918.6697 928.2300 939.0793 947.3640 963.1176 974.2607 981.5604 1006.7888 1054.0824 1067.2758 1075.2215 1087.7627 1119.2535 1130.0661 1145.5406 1175.1916 1193.8131 1210.5667 1219.3578 1234.7428 1243.0042 1263.4102 1275.8787 1283.6056 1286.0930 1297.4859 1325.6346 1326.7902 1330.4905 1372.0101 1385.6669 1393.7316 1404.9014 1418.8555 1462.4824 1468.0806 1468.6994 1472.3134 1477.6778 1482.7966 1501.1525 1643.8602 1646.4188 1659.4859 2972.9390 2976.8013 2978.2421 2984.9365 2990.5250 3042.4732 3046.4563 3051.2886 3056.8764 3063.2736 3065.7709 3070.5820 3072.5209 3072.9521 3078.8054 3084.6991 3499.3123 3521.7302
redmass: 7.9067 5.9554 9.6399 8.6656 3.5563 5.9743 3.3998 3.2965 1.7779 1.3335 1.4112 1.7478 1.6146 3.7830 4.0302 2.7565 3.4951 3.5900 2.8722 2.6268 3.3153 2.3835 3.8064 4.1310 3.3732 3.6697 3.0456 3.6628 1.8048 1.5188 3.5628 2.2645 3.1588 4.8749 3.5359 3.2712 4.5949 2.9145 2.8023 2.5992 2.6604 2.0212 1.7545 1.6907 2.6809 2.3334 1.8555 1.3547 2.8382 2.2875 2.0780 2.0342 1.5632 2.7460 2.3882 1.8770 1.6305 2.3765 2.0192 1.6805 1.5311 1.7238 1.6031 1.7869 1.7705 1.7517 1.5285 1.4284 1.6652 1.6836 1.2022 1.2019 1.1949 1.0864 1.0521 1.0638 1.0546 1.0566 1.0580 1.0628 1.0549 7.9652 10.5411 8.8694 1.0355 1.0364 1.0366 1.0595 1.0601 1.1001 1.1016 1.0856 1.0858 1.0836 1.0992 1.0990 1.0989 1.0987 1.0991 1.0989 1.0639 1.0642
irintensity: 0.4068 2.0880 1.8291 4.1997 0.3799 0.6599 0.7583 0.2498 0.1997 0.1648 0.1997 0.0642 1.4478 0.8350 0.6498 0.4538 4.6146 2.0159 3.4240 0.7019 1.5105 1.0302 4.7261 5.1462 4.5697 18.9051 8.7570 28.2000 133.7952 71.0749 12.1968 58.9445 36.8767 22.3518 1.1618 2.1603 1.2514 14.4229 2.8936 10.1490 10.2508 7.6678 3.3560 7.8323 20.8669 9.8431 7.3805 2.3826 231.9305 63.7757 169.2920 26.3648 8.8488 17.2867 14.8881 7.7569 18.1524 10.3818 11.8514 24.4902 3.2607 8.2534 14.7835 9.0345 8.9858 24.8602 8.3804 14.8324 22.2669 43.6204 23.0764 6.4589 18.7505 16.6823 5.8920 4.2228 14.6411 2.0687 17.4555 4.0084 9.6970 211.3531 139.4629 256.2867 19.7496 32.9980 21.8130 9.8312 34.7972 4.2594 11.9462 3.7962 0.6740 4.9816 6.5075 25.2115 41.2044 47.5254 27.7524 20.8893 30.4065 34.0966
temp: 298.150 k
press: 1.00000 atm
elementType: 8 8 8 8 8 6 6 6 6 6 6 6 6 6 6 6 6 6 1 1 1 1 1 1 1 1 1 1 1 1 1 1 1 1 1 1
symmnumber: 1
zpe: 765943.6 jmol-1
zpe.correction: 0.291732 hartree
zpe.thermalcorrener: 0.309684 hartree
zpe.thermalcorrenthalpy: 0.310628 hartree
zpe.thermalcorrgfe: 0.246741 hartree
zpe.sumelectzpe: -880.943500 hartree
zpe.sumelectthermal: -880.925548 hartree
zpe.sumelectthermalent: -880.924604 hartree
zpe.sumelectthermalfe: -880.988492 hartree
dipole: -2.5151 -2.8814 -1.4717
dipole: 4.0980
quadrupole: -106.8127 -105.7495 -113.9201
quadrupole: -6.3644 7.0477 -2.6730
quadrupole: 2.0147 3.0779 -5.0927 -6.3644 7.0477 -2.6730
hfenergy: -881.2352326 hartree
pointgroup: C01 [X(C13H18O5)]
dipole: 0.794574 1.1639718 -0.7831414 debye
polarizability: 148.9039445|3.0486293|144.5047304|-3.9968052|1.1412453|143.5293928 unknown
InChI: InChI=1S/C13H18O5/c1-12(2)5-13(3)4-6(14)8(12)7(10(15)16)9(13)11(17)18/h7-9,15,17H,4-5H2,1-3H3
charge 0 multiplicity 1
36 atoms
O  -2.469886 -1.587496 -1.125227
O  3.487383 0.681062 -0.544189
O  0.78455 -2.78787 -0.523137
O  2.391701 1.296609 1.40117
O  0.485597 -3.007873 1.767692
C  0.225091 1.001014 -1.109986
C  -1.426862 1.089016 0.90245
C  -1.169575 -0.443479 0.628033
C  -0.519271 1.911295 -0.087988
C  1.179137 0.001209 -0.333763
C  0.36369 -0.761734 0.763937
C  -0.818342 0.096544 -1.825142
C  -1.586319 -0.752265 -0.808557
C  0.999922 1.847836 -2.140511
C  -1.09457 1.440012 2.376131
C  -2.930146 1.39389 0.657557
C  2.362779 0.718413 0.288833
C  0.560234 -2.270198 0.762432
H  -1.751516 -1.061744 1.334028
H  0.221676 2.502991 0.48033
H  -1.137878 2.634145 -0.654438
H  1.576057 -0.706952 -1.079692
H  0.676799 -0.423349 1.765767
H  -0.336265 -0.578045 -2.558661
H  -1.544493 0.713089 -2.391163
H  1.675156 2.571136 -1.64862
H  1.614762 1.214527 -2.805271
H  0.292956 2.421837 -2.76783
H  -1.664671 0.801274 3.076763
H  -0.018276 1.339472 2.60033
H  -1.370987 2.491816 2.577872
H  -3.138932 2.457858 0.873907
H  -3.237778 1.196879 -0.385816
H  -3.573176 0.778992 1.314675
H  4.2343 1.177781 -0.109795
H  0.818949 -3.781392 -0.47782
