program: Gaussian 09
title: 000284570
version: EM64L-G09RevD.01
frameworkgroup: C1[X(C7H6N2O7S)]
method: RPBEPBE
basis: SDD
operation: Freq
keyword: #p
keyword: freq=noraman
keyword: PBEPBE/SDD
title: #p freq=noraman PBEPBE/SDD
converged: NO YES NO NO
title: Mulliken charges:
elementType: S O O O O O O O N N C C C C C C C H H H H H H
charge: 1.024297 -0.374920 -0.472802 -0.489840 -0.170437 -0.166065 -0.178727 -0.175197 0.020768 0.026309 -0.249503 0.499540 -0.153314 -0.463378 0.441496 -0.370762 -0.481147 0.320130 0.343432 0.309288 0.238711 0.271606 0.250512
chargesum: 0.00000
title: Mulliken charges with hydrogens summed into heavy atoms:
elementType: S O O O O O O O N N C C C C C C C
charge: 1.024297 -0.374920 -0.472802 -0.489840 -0.170437 -0.166065 -0.178727 -0.175197 0.020768 0.026309 -0.249503 0.499540 0.166816 -0.119946 0.441496 -0.061473 0.279683
polarizability: 2.16990062e+02 -3.85558177e+00 1.58108635e+02 -2.69551470e+00 -1.04610286e+00 8.10565084e+01
1716.lowfreq: -5.6251 -2.1249 -0.0016 -0.0016 -0.0011 4.8454 25.9736 41.2339 51.1990
frequency: 25.8942 41.2281 51.1971 84.2580 96.8355 106.6058 130.9053 147.0689 150.4589 157.8178 184.7338 207.5711 238.4347 265.0054 306.5937 321.7582 334.3625 373.4826 409.0719 432.8513 469.7037 484.4225 505.9032 528.2174 575.8316 640.1003 647.5934 688.7742 719.1542 738.4924 757.7409 834.1820 858.0811 879.0167 907.8827 961.4816 966.6187 994.0350 1010.3125 1069.1353 1102.0067 1115.4847 1116.2333 1142.5910 1200.9992 1213.5334 1238.8640 1364.2107 1385.8141 1406.4098 1408.9873 1413.2705 1434.1707 1440.5094 1468.8421 1584.2954 1597.8091 2988.1055 3104.1022 3110.4845 3149.2801 3183.2079 3189.9611
redmass: 11.8236 6.9489 12.8385 3.6753 1.5487 2.1655 7.6677 12.1067 6.8632 11.5948 10.6676 6.0446 11.3203 9.3228 7.7935 10.8274 12.8239 8.8200 8.5056 3.8229 8.5372 8.7049 8.1460 7.6665 6.1696 7.8016 8.0438 11.6952 5.0054 5.1940 13.0632 15.1479 9.0801 1.3661 8.8776 15.9423 1.5089 7.6314 1.3632 1.5384 1.3028 5.1195 1.3533 1.4089 11.0000 10.9038 1.4088 4.5573 11.4720 1.6968 2.3115 9.3204 1.0521 2.6999 1.0579 7.1549 8.8471 1.0271 1.1066 1.1036 1.0913 1.0921 1.0951
irintensity: 1.1570 0.3708 0.1011 6.5774 1.3542 3.9564 7.0481 2.2873 3.3965 1.6308 1.3084 3.8848 2.5778 8.9427 3.7359 5.0429 2.9769 25.5105 36.0320 0.8960 19.2090 18.7818 17.3657 87.4308 4.6307 5.5218 14.1247 51.0684 9.9731 2.1643 23.6085 74.8258 13.7154 23.1802 57.8843 82.3044 33.1390 0.6114 0.0690 66.1781 6.3185 11.0883 3.7917 3.4475 234.7676 122.6614 17.5196 28.3937 76.0843 14.9029 60.5641 82.8240 10.8550 26.7170 18.7610 15.6013 10.5543 26.3866 30.2482 3.7152 16.9705 27.2532 5.2958
temp: 298.150 k
press: 1.00000 atm
elementType: 16 8 8 8 8 8 8 8 7 7 6 6 6 6 6 6 6 1 1 1 1 1 1
symmnumber: 1
zpe: 362839.3 jmol-1
zpe.correction: 0.138198 hartree
zpe.thermalcorrener: 0.155031 hartree
zpe.thermalcorrenthalpy: 0.155975 hartree
zpe.thermalcorrgfe: 0.091974 hartree
zpe.sumelectzpe: -1302.839999 hartree
zpe.sumelectthermal: -1302.823166 hartree
zpe.sumelectthermalent: -1302.822222 hartree
zpe.sumelectthermalfe: -1302.886223 hartree
dipole: -0.5554 -1.1372 1.9077
dipole: 2.2893
quadrupole: -119.0339 -114.5984 -105.9217
quadrupole: -7.0608 -9.7339 2.2055
quadrupole: -5.8493 -1.4137 7.2630 -7.0608 -9.7339 2.2055
hfenergy: -1302.9781969 hartree
pointgroup: C01 [X(C7H6N2O7S1)]
dipole: 0.1808841 0.5326619 0.7034201 debye
dipolederiv: 1.8773715 0.1737668 0.0200172 0.256544 1.3474661 -0.0601882 0.1209002 -0.1308365 1.3840311 -0.8123408 0.0185836 -0.1194867 0.1044464 -0.4378196 0.0088447 -0.2249683 0.0438579 -0.528839 -0.6007031 -0.0273938 0.0403417 -0.0803467 -0.4979729 -0.0805919 0.055962 -0.0099843 -0.5546588 -0.6316964 -0.0209187 -0.0164838 -0.0172146 -0.6389197 0.1055016 -0.0075447 0.0361468 -0.4745283 -0.4685511 -0.065306 -0.0632805 -0.1632831 -0.7958739 -0.0645852 -0.0676449 -0.0391159 -0.2090705 -0.6206572 -0.0115408 -0.1281622 0.0903783 -0.4407907 -0.0144164 -0.1128424 -0.0347362 -0.1528107 -0.7422888 0.1946498 0.0160819 0.0987966 -0.5796854 0.0223637 0.033118 0.010953 -0.2068382 -0.6697478 -0.1511896 0.0363892 -0.0947216 -0.6246397 0.0355564 0.040783 0.0415965 -0.2059566 1.0371412 -0.1521296 0.2289969 -0.0874043 1.4078362 0.0930607 0.1773313 0.0752265 0.1968197 1.6989068 0.0035042 -0.090156 0.0540467 1.0254088 -0.0641682 -0.108679 -0.058555 0.191123 0.0216695 0.0797134 -0.0093045 -0.2965353 0.0094194 0.0043159 0.0574777 0.0307167 -0.1699255 -0.314584 0.0243063 -0.0082841 0.3507509 -0.2703489 -0.0229804 -0.0269432 0.0029559 0.0986127 -0.5381352 0.1962535 0.0081237 -0.0291841 -0.069012 0.002833 0.0379298 -0.0076216 -0.0482793 -0.0255637 -0.0544876 -0.0053237 -0.1959363 -0.1243604 0.0214102 0.0324927 -0.0144807 -0.0454401 -0.3711445 -0.004887 0.0274548 -0.1313194 -0.0413361 0.0127518 0.0495421 0.0096037 0.0851423 0.1646943 -0.1532933 -0.0023214 0.2589121 0.0332894 -0.0154445 -0.0494923 -0.0017334 -0.0654888 0.6304712 -0.0040646 0.1864265 -0.064732 0.1895745 -0.0326667 -0.1248761 0.0536066 0.0314428 0.1727256 -0.0377774 0.0123131 0.0100812 0.1185326 0.0017966 0.0045553 0.0104075 0.1482818 0.1612323 -0.0148759 0.0082142 0.01007 0.1619379 0.0032485 -0.0173777 0.0090579 0.1818714 0.1042524 0.0357046 0.0031797 0.0057681 0.1111856 0.0033887 0.0038368 0.0050977 0.1703322 -0.1548128 -0.0597121 -0.0346584 -0.1015069 -0.0096453 0.0407059 0.0620709 0.031911 0.1025087 0.0839087 -0.0035962 -0.0446623 0.0028106 0.0035668 -0.0585914 0.0590076 -0.1042918 0.084046 -0.0021483 0.0346905 -0.0654153 0.0195793 0.1221873 0.0578555 0.0053612 0.0402179 -0.012376 unknown
polarizability: 217.2029397|0.795606|157.382709|3.3365007|-6.167626|81.5695568 unknown
InChI: InChI=1S/C7H6N2O7S/c1-16-17(14,15)7-3-2-5(8(10)11)4-6(7)9(12)13/h2-4H,1H3
charge 0 multiplicity 1
23 atoms
S  2.339046 1.116884 -0.458584
O  2.958381 0.840882 1.270301
O  3.078498 0.169964 -1.535671
O  2.30693 2.714195 -0.705865
O  0.207164 -3.023945 -0.148115
O  2.04612 -1.743098 0.275909
O  -4.484239 1.145044 0.139289
O  -4.179443 -1.114709 0.27356
N  0.79539 -1.892632 0.024622
N  -3.744659 0.091167 0.158959
C  0.482732 0.641714 -0.18334
C  -0.046536 -0.661376 -0.049067
C  -0.364416 1.76296 -0.203733
C  -1.439638 -0.848417 0.05295
C  -2.26827 0.286671 0.039658
C  -1.758205 1.593833 -0.083519
C  4.28235 0.181121 1.317209
H  0.080691 2.756615 -0.32489
H  -1.855657 -1.855501 0.144484
H  -2.442412 2.445986 -0.089379
H  5.08703 0.883102 1.038564
H  4.304087 -0.719142 0.679885
H  4.373856 -0.109718 2.377574
