program: Gaussian 09
title: 000284582
version: EM64L-G09RevD.01
frameworkgroup: C1[X(C14H9Cl2N5O)]
method: RPBEPBE
basis: SDD
operation: Freq
keyword: #p
keyword: freq=noraman
keyword: PBEPBE/SDD
title: #p freq=noraman PBEPBE/SDD
converged: YES YES NO NO
title: Mulliken charges:
elementType: Cl Cl O N N N N N C C C C C C C C C C C C C C H H H H H H H H H
charge: -0.039998 -0.033871 -0.285447 -0.159473 0.042779 -0.025183 -0.086221 -0.064708 0.440810 -0.354006 -0.344528 0.026439 -0.248171 -0.175410 -0.181293 -0.122270 0.158564 -0.260651 -0.316122 -0.178137 -0.183771 -0.114018 0.294152 0.313162 0.305672 0.260415 0.260902 0.282467 0.265438 0.259710 0.262768
chargesum: 0.00000
title: Mulliken charges with hydrogens summed into heavy atoms:
elementType: Cl Cl O N N N N N C C C C C C C C C C C C C C
charge: -0.039998 -0.033871 -0.285447 -0.159473 0.042779 -0.025183 -0.086221 -0.064708 0.440810 -0.059854 -0.031367 0.026439 0.057501 0.085005 0.079609 -0.122270 0.158564 0.021816 -0.050684 0.081572 0.078997 -0.114018
polarizability: 5.91397438e+02 -1.50448616e+01 2.32899701e+02 -5.39827146e-01 1.88625061e-01 7.50474410e+01
1716.lowfreq: -5.0654 -4.9408 -0.0019 -0.0002 0.0016 1.3049 16.4607 19.4873 28.8554
frequency: 16.0245 19.3078 28.8472 37.7718 56.1616 96.6476 101.4899 148.3437 152.2374 171.5393 229.5873 249.8277 258.5556 269.9017 307.0661 315.7306 337.5195 350.2069 406.6325 414.7036 416.0798 425.5806 461.2203 504.2842 509.9796 517.6600 575.6770 600.8721 619.0915 620.7503 626.6122 659.5245 679.5832 701.9254 714.6108 720.9701 757.8997 764.0247 829.0311 830.2167 837.0199 849.0724 866.5096 930.9683 967.2843 970.4028 976.6499 984.2408 991.9905 993.8042 995.4302 1064.6744 1069.8970 1075.2280 1101.0663 1111.2531 1135.6117 1159.3286 1171.0759 1186.9656 1218.0518 1282.9772 1293.4902 1314.5415 1329.8437 1357.6891 1374.8893 1378.4163 1406.0577 1407.7428 1450.4817 1469.1592 1473.3966 1508.6491 1568.9764 1580.0925 1590.2814 1593.8355 3159.0310 3160.8708 3168.7263 3171.8930 3177.3575 3181.7695 3190.7740 3210.2571 3286.8961
redmass: 3.9373 4.8870 12.0772 9.4401 9.7757 9.9592 9.9668 8.4924 10.3750 9.7161 10.3621 12.5077 9.0867 9.3418 7.6844 6.5528 6.1955 6.8715 3.1349 3.2915 10.7129 6.1981 7.9418 3.0718 8.1043 3.2190 8.5248 5.8249 7.2424 7.8572 7.5923 3.0065 9.1370 4.0241 7.2917 3.3739 8.1000 1.7335 1.2443 1.2449 1.4806 1.5467 7.3030 8.8366 1.3175 1.3591 1.3416 1.3486 4.2709 4.2673 4.3375 3.1158 3.4164 3.5160 1.3005 1.4413 1.8765 2.2359 1.7916 1.1704 2.5447 1.2949 1.2806 7.5519 5.9865 8.7183 7.5593 6.8249 3.8599 4.1331 2.9627 3.3203 2.9927 7.9425 7.4705 8.3973 6.7023 6.2435 1.0883 1.0889 1.0900 1.0918 1.0969 1.0979 1.0965 1.0950 1.1000
irintensity: 0.0061 0.0035 0.0610 0.1412 0.0006 0.1193 0.3675 2.1670 0.4200 0.1638 1.2293 0.1950 6.8797 3.2746 1.6127 3.0672 16.9930 0.8092 0.0811 0.9266 18.1846 8.4735 12.9299 4.5797 83.4770 34.3056 1.1152 6.2015 3.6528 3.2065 1.5652 9.3911 2.6958 0.4308 16.7447 9.9719 103.8460 31.3312 0.2271 0.4534 84.9100 78.8572 21.6027 57.9017 3.9556 1.6760 0.0907 0.6962 33.7386 41.0219 39.7217 132.6421 34.8101 53.8152 11.4498 27.9900 18.4592 67.3663 3.5397 8.3600 31.0412 6.9129 3.3801 103.2570 29.0318 54.9287 5.2195 2.9166 23.0151 7.5673 51.8470 39.5773 151.1557 213.9005 32.5901 7.1591 95.8392 20.4333 1.2840 0.5268 1.2313 2.5910 5.0217 6.0072 0.7729 9.6211 13.7796
temp: 298.150 k
press: 1.00000 atm
elementType: 17 17 8 7 7 7 7 7 6 6 6 6 6 6 6 6 6 6 6 6 6 6 1 1 1 1 1 1 1 1 1
symmnumber: 1
zpe: 545786.1 jmol-1
zpe.correction: 0.207879 hartree
zpe.thermalcorrener: 0.226553 hartree
zpe.thermalcorrenthalpy: 0.227497 hartree
zpe.thermalcorrgfe: 0.156770 hartree
zpe.sumelectzpe: -1806.328376 hartree
zpe.sumelectthermal: -1806.309702 hartree
zpe.sumelectthermalent: -1806.308758 hartree
zpe.sumelectthermalfe: -1806.379485 hartree
dipole: 1.4326 -0.1937 0.0019
dipole: 1.4457
quadrupole: -149.7317 -132.9914 -143.8786
quadrupole: 2.8929 -0.2333 0.1764
quadrupole: -7.5312 9.2092 -1.6780 2.8929 -0.2333 0.1764
hfenergy: -1806.5362547 hartree
pointgroup: C01 [X(C14H9Cl2N5O1)]
dipole: 0.5654664 -0.0526007 -0.0313148 debye
polarizability: 591.9112664|-6.9264983|176.3381803|0.4067999|75.3072028|131.095133 unknown
InChI: InChI=1S/C14H9Cl2N5O/c15-10-1-5-12(6-2-10)17-18-14-9-20(22)21(19-14)13-7-3-11(16)4-8-13/h1-9H
charge 0 multiplicity 1
31 atoms
Cl -7.043148 -1.978605 -1.52653
Cl 8.023208 -0.841209 -0.49406
O  -2.817481 2.475593 1.824177
N  -1.95986 0.615324 0.462899
N  -1.822195 1.797693 1.334437
N  -0.74035 0.118938 0.106797
N  1.577284 0.840893 0.661445
N  2.034841 -0.155325 -0.059994
C  -3.187812 0.039651 0.01974
C  -3.098394 -1.078151 -0.853952
C  -4.451562 0.544146 0.424739
C  0.177402 0.942687 0.722029
C  -0.468341 1.963768 1.469149
C  -4.273203 -1.69161 -1.323824
C  -5.624546 -0.078484 -0.052364
C  -5.524509 -1.183599 -0.917041
C  3.460195 -0.235159 -0.104436
C  4.356401 0.659425 0.551031
C  3.972526 -1.311604 -0.877525
C  5.74386 0.474111 0.431352
C  5.362743 -1.504355 -1.002346
C  6.227025 -0.606066 -0.344031
H  -2.114672 -1.449219 -1.150018
H  -4.516499 1.401857 1.093752
H  -0.062498 2.770179 2.068034
H  -4.214237 -2.55176 -1.996317
H  -6.603911 0.300408 0.252456
H  3.945509 1.483069 1.142093
H  3.261637 -1.982524 -1.369492
H  6.446527 1.15008 0.927101
H  5.765957 -2.329954 -1.594699
