program: Gaussian 09
title: 000284587
version: EM64L-G09RevD.01
frameworkgroup: C1[X(C13H12O7)]
method: RPBEPBE
basis: SDD
operation: Freq
keyword: #pfreq=noraman
keyword: PBEPBE/SDD
title: #p freq=noraman PBEPBE/SDD
converged: YES YES NO NO
title: Mulliken charges:
elementType: O O O O O O O C C C C C C C C C C C C C H H H H H H H H H H H H
charge: -0.263982 -0.195975 -0.271364 -0.153451 -0.150847 -0.240112 -0.203453 0.279683 -0.302254 -0.337807 -0.293563 -0.622726 0.386786 -0.389273 0.179203 0.163778 0.294138 0.253989 -0.764295 -0.748714 0.332252 0.351934 0.307883 0.290240 0.264829 0.295952 0.272343 0.250525 0.246295 0.259177 0.253644 0.255164
chargesum: 0.00000
title: Mulliken charges with hydrogens summed into heavy atoms:
elementType: O O O O O O O C C C C C C C C C C C C C
charge: -0.263982 -0.195975 -0.271364 -0.153451 -0.150847 -0.240112 -0.203453 0.279683 0.029999 0.014127 0.014321 -0.067657 0.386786 -0.093322 0.179203 0.163778 0.294138 0.253989 0.004867 0.019272
polarizability: 2.02594680e+02 1.43606977e+01 1.46354461e+02 -8.97725241e-01 7.61942444e+00 1.14249658e+02
1716.lowfreq: -1.4119 -0.0010 -0.0008 -0.0008 4.8983 10.8599 32.0225 45.7546 54.2333
frequency: 31.9504 45.7461 54.2312 59.0828 69.7518 75.4256 85.9215 102.0702 133.4241 138.5332 165.1981 181.3065 195.3540 263.0091 276.4758 310.0200 331.8330 347.9521 399.1907 425.3550 477.2179 500.6789 523.5196 539.8565 556.4934 567.8973 573.5795 578.5949 615.3302 633.3882 663.0100 697.8109 706.7820 760.6933 789.7061 799.4641 808.4468 825.2737 837.4653 850.2455 877.8772 919.9992 932.8332 955.8139 984.9047 992.5446 1005.2963 1038.5406 1040.8251 1044.4808 1044.7329 1061.8980 1100.2469 1120.9261 1126.7956 1142.2958 1161.2253 1181.0572 1197.4354 1214.5769 1236.6235 1251.3943 1261.6627 1273.9895 1282.8854 1309.4859 1384.1837 1387.4145 1450.8833 1451.6648 1451.8538 1452.9848 1496.9891 1625.9210 1659.7510 1681.6774 1695.9281 1762.2805 3006.5856 3010.2985 3043.3906 3067.8067 3096.8289 3098.1276 3099.5325 3129.3572 3144.6217 3146.3371 3147.8640 3229.7069
redmass: 3.1540 1.9277 9.8449 3.9195 2.1897 4.1135 6.0851 1.1368 9.7895 8.3478 7.3192 7.7327 8.1261 5.0593 4.7500 4.4772 3.7854 8.0674 5.2745 4.4988 3.4735 3.6324 4.8261 3.9208 3.4076 4.8156 6.6678 5.1046 4.0137 5.8517 6.6549 5.2913 5.9625 4.0570 5.2687 5.9507 5.5428 5.7761 2.3813 5.5434 3.2179 3.7539 2.3247 2.1966 2.0533 2.0609 1.9875 3.0312 1.6804 1.9221 1.8085 2.7770 2.5612 3.9738 1.9736 1.6585 2.7582 2.2680 2.4575 1.6890 1.7444 1.8891 1.5095 2.0290 1.5860 1.7915 1.2382 1.2345 1.0523 1.0548 1.0505 1.0550 1.0989 8.0445 10.0709 10.2068 12.9172 12.8023 1.0382 1.0371 1.0635 1.0864 1.0970 1.0867 1.0946 1.1040 1.1022 1.0919 1.1012 1.0995
irintensity: 1.6676 2.5824 0.7513 2.6399 0.8485 3.7362 1.2262 0.3775 2.7242 1.1115 6.2349 5.3870 1.1870 2.5425 5.7302 6.0701 2.8119 12.2776 5.8029 0.5679 7.3098 1.5731 9.8256 18.3744 15.4904 1.9295 3.5190 4.5804 20.2376 2.4798 2.6581 16.2238 9.2260 17.4145 11.6855 19.1126 175.5224 175.0088 33.2902 33.7103 25.8229 15.0890 11.4903 2.8152 80.7418 44.4109 5.0452 113.5645 29.4864 118.1818 12.9968 218.4733 13.2268 78.2112 131.6178 27.3203 467.4415 146.2108 134.1970 6.4979 3.5440 5.4713 16.3926 17.5985 13.0534 52.2914 72.3251 55.4707 21.5993 21.6157 20.3840 24.3427 15.5582 70.5229 143.0349 163.2896 503.0857 131.6485 0.3894 0.3236 13.5932 3.1035 4.0257 3.2172 5.0326 9.4057 7.7626 0.8538 8.2703 4.3799
temp: 298.150 k
press: 1.00000 atm
elementType: 8 8 8 8 8 8 8 6 6 6 6 6 6 6 6 6 6 6 6 6 1 1 1 1 1 1 1 1 1 1 1 1
symmnumber: 1
zpe: 606982.9 jmol-1
zpe.correction: 0.231188 hartree
zpe.thermalcorrener: 0.249748 hartree
zpe.thermalcorrenthalpy: 0.250692 hartree
zpe.thermalcorrgfe: 0.182754 hartree
zpe.sumelectzpe: -1027.675127 hartree
zpe.sumelectthermal: -1027.656567 hartree
zpe.sumelectthermalent: -1027.655623 hartree
zpe.sumelectthermalfe: -1027.723560 hartree
dipole: 2.8755 -4.4555 -1.0096
dipole: 5.3981
quadrupole: -106.6614 -129.3990 -115.5951
quadrupole: 3.3910 -13.7557 -5.6638
quadrupole: 10.5571 -12.1805 1.6234 3.3910 -13.7557 -5.6638
hfenergy: -1027.9063144 hartree
pointgroup: C01 [X(C13H12O7)]
dipole: 1.4958612 -1.3843256 -0.5969828 debye
polarizability: 192.9003228|26.0499675|153.8618474|-1.7873143|11.0072148|116.4366283 unknown
InChI: InChI=1S/C13H12O7/c1-5(14)18-8-4-13(20-6(2)15)3-7(8)9-10(13)12(17)19-11(9)16/h4,7,9-10H,3H2,1-2H3
charge 0 multiplicity 1
32 atoms
O  -1.515599 -1.826029 0.746241
O  -2.070451 2.267432 0.337172
O  2.990276 -0.402902 -0.701837
O  -3.458685 0.45273 -0.156473
O  -0.233674 3.703333 0.506994
O  -1.786699 -2.527129 -1.465904
O  4.033423 0.406842 1.240858
C  -0.495732 -0.868273 0.342041
C  1.068558 0.738942 0.657379
C  -1.008496 0.30559 -0.621543
C  0.074961 1.397822 -0.401798
C  0.06327 -0.059036 1.541445
C  1.720576 -0.433331 -0.089985
C  0.788536 -1.401661 -0.301429
C  -2.321074 0.926794 -0.160461
C  -0.669229 2.598283 0.178828
C  -2.147858 -2.579427 -0.271399
C  4.113862 0.079814 0.044515
C  -3.285289 -3.378436 0.307484
C  5.330531 0.098257 -0.844912
H  1.737254 1.450616 1.154162
H  -1.114127 -0.075467 -1.647397
H  0.614553 1.708557 -1.310704
H  0.569781 -0.703936 2.273539
H  -0.691067 0.565114 2.05011
H  0.860843 -2.301251 -0.910071
H  -4.146836 -2.70171 0.45684
H  -3.014392 -3.795964 1.290271
H  -3.576188 -4.178507 -0.388459
H  5.510629 -0.908106 -1.260434
H  6.206274 0.429311 -0.269434
H  5.166468 0.777725 -1.699438
