program: Gaussian 09
title: 000284604
version: EM64L-G09RevD.01
frameworkgroup: C1[X(C18H22O8)]
method: RPBEPBE
basis: SDD
operation: Freq
keyword: #pfreq=noraman
keyword: PBEPBE/SDD
title: #p freq=noraman PBEPBE/SDD
converged: NO YES NO NO
title: Mulliken charges:
elementType: O O O O O O O O C C C C C C C C C C C C C C C C C C H H H H H H H H H H H H H H H H H H H H H H
charge: -0.308689 -0.272179 -0.284147 -0.253491 -0.237409 -0.206774 -0.231730 -0.211095 0.388161 -0.547117 -0.569925 0.160222 0.181285 0.213761 0.358643 -0.340810 -0.767496 -0.765076 0.095910 0.105124 0.280952 0.264020 -0.771363 -0.499415 -0.765021 -0.499828 0.317432 0.248783 0.278847 0.319264 0.219465 0.242185 0.213645 0.217427 0.218649 0.238873 0.244869 0.261856 0.250848 0.243048 0.232222 0.246361 0.259625 0.251400 0.253240 0.240388 0.254854 0.230204
chargesum: 0.00000
title: Mulliken charges with hydrogens summed into heavy atoms:
elementType: O O O O O O O O C C C C C C C C C C C C C C C C C C
charge: -0.308689 -0.272179 -0.284147 -0.253491 -0.237409 -0.206774 -0.231730 -0.211095 0.388161 -0.229684 -0.042295 0.160222 0.181285 0.213761 0.358643 -0.021547 -0.092201 -0.090126 0.095910 0.105124 0.280952 0.264020 -0.013790 0.222216 -0.000755 0.225618
polarizability: 2.43202462e+02 -1.12672401e+01 2.45302568e+02 1.60709564e+00 -8.14344864e+00 1.77834163e+02
1716.lowfreq: -55.6021 -44.5550 -3.7854 0.0005 0.0007 0.0007 3.0753 10.1103 31.0478
frequency: -55.6003 -44.5440 31.0386 34.4924 41.0030 51.6935 57.5278 66.2552 68.1879 74.1125 82.5152 90.5010 104.3424 113.7796 117.2605 123.7249 158.7823 170.5936 189.6657 197.8278 201.6076 229.1557 234.1131 244.9648 265.5944 275.6401 276.6457 279.5687 286.6670 303.7307 331.6523 338.6666 372.0000 376.9496 425.1855 455.1376 463.3833 475.8924 497.7521 507.1796 529.3153 565.7374 577.1367 583.7147 605.6474 667.3635 672.5823 683.1659 700.7451 714.0815 743.4789 759.4603 794.9852 807.9450 810.6861 830.0720 870.6519 882.1450 897.2146 915.3726 936.2245 938.9364 956.1801 966.9839 982.7591 997.7924 1007.1257 1015.1862 1025.2508 1044.5858 1046.8029 1050.3052 1065.3974 1107.8223 1112.7310 1114.9607 1129.3260 1147.8109 1148.9927 1150.1180 1162.2874 1184.3558 1188.5355 1193.2257 1208.9537 1231.4411 1247.1285 1267.7928 1293.0123 1303.9452 1323.4927 1380.3148 1385.4984 1385.6972 1398.4879 1418.8851 1424.3278 1451.7021 1452.3263 1453.9830 1454.2170 1457.6027 1457.7869 1463.3508 1463.6950 1464.1345 1471.0936 1474.9942 1481.7797 1491.9311 1604.8933 1613.3197 1628.7495 1644.9803 1656.0813 1664.5453 2973.2448 2976.9430 3003.7797 3005.3234 3007.9477 3008.5970 3021.0357 3065.1115 3071.4446 3077.8957 3082.7864 3094.6407 3096.4910 3098.2355 3105.2443 3110.0191 3110.5212 3140.9715 3142.1772 3148.6028 3150.2111 3243.4587
redmass: 1.0551 1.0572 5.4429 5.9365 4.8255 4.6460 4.0413 5.3198 3.9296 3.6435 4.3909 3.4012 1.4016 1.2302 2.1723 3.6948 4.8384 3.9164 5.5018 6.3429 5.2060 4.7748 1.7594 2.0416 3.4869 1.7532 2.6354 3.0911 3.7066 3.0868 4.2210 5.7314 3.3815 3.2183 2.4470 3.5181 3.8733 4.1351 4.9344 4.8295 5.2304 3.5531 3.4693 3.5526 5.8186 7.1437 7.8037 7.0997 6.7832 4.6818 6.5372 5.6129 3.8970 3.7180 5.3133 2.7804 5.9291 2.7395 4.9982 2.2780 3.4479 1.7272 2.1382 3.7902 3.3304 1.9437 2.1887 1.6292 4.3526 1.6103 1.7005 2.6584 2.2887 2.2263 1.5435 1.2663 2.5111 1.8429 1.4678 1.5947 2.9857 3.2475 3.4024 2.7810 2.4181 2.8397 2.0432 1.8950 2.5186 1.6676 3.2688 1.1946 1.2197 1.2205 1.1978 1.1864 1.1931 1.0495 1.0499 1.0608 1.0643 1.0463 1.0457 1.0515 1.0526 1.0508 1.0499 1.0698 1.0595 1.0555 9.7873 9.2582 9.1584 10.9795 11.1567 10.9657 1.0353 1.0358 1.0295 1.0291 1.0367 1.0365 1.0609 1.0998 1.0990 1.1000 1.0990 1.0971 1.0973 1.1031 1.1044 1.1048 1.0874 1.1012 1.1009 1.1048 1.1050 1.0971
irintensity: 1.1388 1.3963 1.0743 1.0214 0.1812 4.4335 1.1260 0.8914 2.0155 2.3836 1.8284 0.8190 1.0135 0.1046 0.6934 1.6695 3.5090 3.4620 1.2483 0.9592 1.4053 2.9075 0.3896 2.0501 2.6673 0.7306 2.6580 15.4668 4.4002 15.0191 0.8682 21.0725 1.9785 0.7766 0.2688 0.7753 3.0219 7.5423 7.5137 16.4146 4.8147 4.7118 2.8090 0.7786 5.3147 5.6462 9.5789 5.0624 11.6887 17.2146 15.2092 10.5409 14.8138 3.9843 39.3913 10.2156 26.2117 1.1622 10.2518 3.2991 13.0524 6.1488 21.5900 47.7031 47.0198 58.7568 134.6997 44.7320 13.6177 10.8708 22.8063 60.0937 42.9078 89.8150 42.8638 0.2508 121.6829 208.5215 14.8407 101.8890 239.6040 360.0446 196.7434 187.3275 108.7833 40.9834 45.2306 0.7374 35.1500 33.8471 103.9484 17.1716 77.5559 22.9014 12.1897 22.8282 22.9656 12.9522 12.4484 17.4858 8.6555 13.7133 16.0474 9.0576 10.5535 9.9583 1.2558 11.1491 4.5378 9.2648 151.0440 101.8750 119.4977 99.7944 183.7960 119.9643 21.3724 37.7685 37.8431 35.5286 3.3063 2.6128 13.8881 1.5103 47.8637 16.8355 35.1888 4.7795 4.9031 5.2272 22.3072 19.0883 3.1989 6.7697 6.8411 15.5249 14.6392 7.7113
temp: 298.150 k
press: 1.00000 atm
elementType: 8 8 8 8 8 8 8 8 6 6 6 6 6 6 6 6 6 6 6 6 6 6 6 6 6 6 1 1 1 1 1 1 1 1 1 1 1 1 1 1 1 1 1 1 1 1 1 1
symmnumber: 1
zpe: 973490.0 jmol-1
zpe.correction: 0.370783 hartree
zpe.thermalcorrener: 0.397745 hartree
zpe.thermalcorrenthalpy: 0.398690 hartree
zpe.thermalcorrgfe: 0.312698 hartree
zpe.sumelectzpe: -1298.916989 hartree
zpe.sumelectthermal: -1298.890027 hartree
zpe.sumelectthermalent: -1298.889082 hartree
zpe.sumelectthermalfe: -1298.975073 hartree
dipole: -0.2516 -2.8008 2.7636
dipole: 3.9428
quadrupole: -135.0875 -133.3615 -157.4225
quadrupole: -17.2591 -6.7890 -0.2170
quadrupole: 6.8697 8.5957 -15.4654 -17.2591 -6.7890 -0.2170
hfenergy: -1299.2877719 hartree
pointgroup: C01 [X(C18H22O8)]
dipole: -0.7022608 0.4541939 1.3064278 debye
polarizability: 250.0379333|7.820893|231.9582487|-18.9277985|9.8152083|184.3430119 unknown
InChI: InChI=1S/C18H22O8/c1-9(19)25-11-7-18(26-10(2)20)8-17(3,4)13(11)12(15(21)23-5)14(18)16(22)24-6/h7,13H,8H2,1-6H3
charge 0 multiplicity 1
48 atoms
O  2.491393 -0.484893 -0.640821
O  -2.234422 -2.13482 -0.466276
O  -2.747316 2.130019 0.795321
O  1.984821 2.767637 0.071894
O  -1.105503 3.352908 -0.325298
O  1.478062 2.152676 -2.124052
O  2.920715 -2.723369 -0.092729
O  -1.285567 -3.535296 -2.09915
C  -0.303208 -0.635145 2.080354
C  -1.256062 -0.291426 0.835205
C  1.160084 -0.734271 1.517209
C  1.137138 -0.49953 -0.045158
C  -0.726521 1.008067 0.228985
C  0.550731 0.903643 -0.242855
C  -1.059315 -1.392812 -0.194684
C  0.200994 -1.530444 -0.68015
C  -0.7476 -1.979103 2.709658
C  -0.412033 0.488346 3.142399
C  -1.49242 2.271296 0.186279
C  1.353963 1.988503 -0.892536
C  3.278438 -1.64751 -0.619855
C  -2.273417 -3.177098 -1.429468
C  4.597211 -1.395401 -1.316818
C  -3.591684 3.347015 0.784916
C  -3.669282 -3.751994 -1.507727
C  2.748633 3.927284 -0.453193
H  -2.303531 -0.204433 1.155138
H  1.816682 0.027805 1.973471
H  1.588839 -1.73188 1.699954
H  0.552481 -2.262309 -1.402978
H  -0.110533 -2.224231 3.579722
H  -0.666889 -2.812529 1.989976
H  -1.795365 -1.923936 3.060842
H  0.201876 0.236772 4.027251
H  -1.458502 0.614157 3.477708
H  -0.05555 1.457469 2.7508
H  5.426585 -1.59616 -0.616569
H  4.662487 -0.363866 -1.690391
H  4.701411 -2.101255 -2.159263
H  -3.086361 4.167836 1.321382
H  -4.519399 3.050653 1.294112
H  -3.789492 3.663851 -0.252968
H  -4.342755 -3.273887 -0.782904
H  -3.627632 -4.839172 -1.321641
H  -4.063615 -3.610028 -2.52933
H  3.524583 3.587453 -1.159629
H  2.058918 4.617746 -0.966365
H  3.193829 4.395865 0.435431
