program: Gaussian 09
title: 000284518
version: EM64L-G09RevD.01
frameworkgroup: C1[X(C5H8O4S)]
method: RPBEPBE
basis: SDD
operation: Freq
keyword: #pfreq=noraman
keyword: PBEPBE/SDD
title: #p freq=noraman PBEPBE/SDD
converged: YES YES NO NO
title: Mulliken charges:
elementType: S O O O O C C C C C H H H H H H H H
charge: 0.944655 -0.542279 -0.529570 -0.421404 -0.203629 -0.411664 -0.409528 -0.556718 -0.413768 0.213544 0.341033 0.264586 0.247917 0.295535 0.278464 0.255181 0.251375 0.396269
chargesum: 0.00000
title: Mulliken charges with hydrogens summed into heavy atoms:
elementType: S O O O O C C C C C
charge: 0.944655 -0.542279 -0.529570 -0.025134 -0.203629 -0.070631 0.102975 0.017280 0.092789 0.213544
polarizability: 1.05392703e+02 1.77392468e+00 9.14446557e+01 -3.86727333e-01 5.20879852e-01 8.17581429e+01
1716.lowfreq: -12.1507 -7.2324 -0.0029 -0.0019 0.0014 9.1853 38.0740 64.3629 105.4490
frequency: 37.7865 64.3197 105.4446 170.3191 174.1394 241.5785 266.9446 274.7644 294.3246 370.7193 411.6035 463.5900 527.0526 550.9372 573.3151 602.5226 705.4246 794.6885 819.3806 857.1238 873.7047 894.9964 921.6522 976.3353 1014.1851 1057.3011 1077.9666 1100.7104 1135.7677 1156.8167 1221.1097 1246.8572 1282.9547 1309.5701 1336.8623 1349.1955 1414.4478 1450.7988 1462.6815 1646.8075 3011.8361 3021.1429 3059.4644 3074.4838 3094.0530 3114.0724 3162.3718 3537.5439
redmass: 4.1858 10.6620 8.4517 3.9590 5.4872 3.7913 7.8932 4.0006 2.7370 8.1651 9.3748 3.7150 3.6670 3.3154 2.3025 1.5145 5.9796 2.9822 6.7791 2.0673 1.9996 2.4723 3.9102 1.9515 1.8963 1.7546 1.1428 2.1494 1.4425 1.5389 1.3594 1.2721 1.2746 2.7190 1.3634 1.2399 1.1056 1.0846 1.0872 8.7937 1.0597 1.0620 1.0613 1.0987 1.1000 1.0905 1.1121 1.0644
irintensity: 1.1551 0.6538 2.8074 0.2702 2.7113 1.7902 10.0436 1.7600 1.1687 13.9699 67.3489 6.4239 14.8523 50.7996 54.9372 67.2641 13.7657 14.6274 80.7398 22.4619 18.3821 2.2487 23.7963 89.0078 6.1382 83.7197 2.8376 112.7931 10.9438 23.2028 4.2798 7.0894 1.8892 64.8783 3.0153 3.0228 11.6782 14.0637 8.1862 286.8545 10.2992 16.5294 1.7298 3.3219 8.3916 0.1851 0.5819 52.1824
temp: 298.150 k
press: 1.00000 atm
elementType: 16 8 8 8 8 6 6 6 6 6 1 1 1 1 1 1 1 1
symmnumber: 1
zpe: 342799.9 jmol-1
zpe.correction: 0.130566 hartree
zpe.thermalcorrener: 0.141240 hartree
zpe.thermalcorrenthalpy: 0.142184 hartree
zpe.thermalcorrgfe: 0.093579 hartree
zpe.sumelectzpe: -893.346867 hartree
zpe.sumelectthermal: -893.336192 hartree
zpe.sumelectthermalent: -893.335248 hartree
zpe.sumelectthermalfe: -893.383853 hartree
dipole: 0.9642 6.8962 1.7544
dipole: 7.1809
quadrupole: -64.6032 -71.9319 -68.1610
quadrupole: 3.4713 -1.2165 -1.9710
quadrupole: 3.6288 -3.6999 0.0710 3.4713 -1.2165 -1.9710
hfenergy: -893.4774323 hartree
pointgroup: C01 [X(C5H8O4S1)]
dipole: 0.4630819 -2.6878631 -0.7366736 debye
dipolederiv: 1.2468946 0.1180668 0.0225609 0.275176 1.2796416 -0.0230765 -0.1073264 -0.0554851 1.0861698 -0.6221354 -0.1212765 -0.0638035 -0.0533742 -0.5755367 -0.0171284 -0.1111901 -0.1625736 -0.5675696 -0.4763221 0.0943132 -0.0411783 -0.00943 -0.6499507 0.0767943 0.0184763 0.2173859 -0.5726477 -0.448915 -0.16322 -0.1723105 -0.1165367 -0.4151888 -0.2363166 -0.3009619 -0.3751206 -0.9791266 -0.8859266 0.1675458 0.2634673 0.3561467 -0.3659157 -0.2714179 -0.0003836 -0.1376055 -0.5811871 -0.6755905 -0.1395628 0.032728 -0.0137277 0.048649 0.0092532 -0.0855605 -0.0739746 -0.0487812 -0.0297396 0.0052704 0.004046 -0.0248426 0.0101339 -0.0235316 0.0218756 0.1413363 0.057352 -0.1064968 -0.0111273 0.0332951 -0.1268167 0.0197983 0.0245268 0.0513455 0.0104507 -0.062094 0.0059033 0.0190805 0.0326 0.0939126 -0.0652162 0.03129 0.0916636 -0.1097718 0.0818921 1.4820915 -0.0488968 -0.0836803 -0.5425393 0.2912644 0.5063738 0.4845597 0.5887931 1.1187114 0.0228487 -0.023666 0.0046844 -0.0259025 0.0203889 -0.0132822 -0.0120037 -0.0195512 0.0291962 0.0585152 -0.0183454 -0.0277697 -0.0171481 0.0760212 -0.0246716 -0.0454434 -0.0714328 -0.01619 0.0846707 -0.0136391 0.0272627 -0.0328547 -0.0516914 0.0930086 0.0216334 0.0756287 0.0205529 -0.0149266 -0.0427807 0.0248243 -0.0003132 0.0466422 -0.0089804 0.0227268 -0.0130606 0.0851357 0.0478914 0.0347535 -0.0388276 0.0528344 0.0156596 -0.0411896 -0.0313982 -0.0013474 -0.0273735 0.0253076 -0.0181229 -0.0417272 -0.0592044 0.0876633 -0.031522 -0.0841489 0.02554 -0.0579057 0.0733905 0.0558607 0.0212503 0.0970331 -0.0753844 -0.0613208 0.0160326 -0.0286129 0.0849104 0.2125392 0.1057466 0.0025782 0.1475873 0.3030215 0.0111909 0.050103 -0.0105987 0.3489548 unknown
polarizability: 105.4690821|-1.3995835|91.3330613|0.6213693|0.6991118|81.7933581 unknown
InChI: InChI=1S/C5H8O4S/c6-5(7)4-2-1-3-10(4,8)9/h4,6H,1-3H2
charge 0 multiplicity 1
18 atoms
S  0.890037 0.914617 -0.005922
O  1.69922 1.508842 1.282362
O  0.239445 1.905374 -1.122172
O  -1.990002 -0.568137 -1.08186
O  -2.658733 0.580897 0.832227
C  -0.452446 -0.475026 0.753148
C  0.155872 -1.814023 0.320208
C  1.981378 -0.493253 -0.801948
C  1.697529 -1.688399 0.104081
C  -1.80272 -0.099026 0.22603
H  -0.37115 -0.24172 1.82488
H  -0.322449 -2.145424 -0.616146
H  -0.04405 -2.574528 1.096235
H  3.006208 -0.097472 -0.771249
H  1.594709 -0.594988 -1.827579
H  2.219922 -1.560246 1.069598
H  2.075396 -2.615041 -0.363619
H  -2.843866 -0.207349 -1.442075
