program: Gaussian 09
title: 000284524
version: EM64L-G09RevD.01
frameworkgroup: C1[X(C11H12O2S)]
method: RPBEPBE
basis: SDD
operation: Freq
keyword: #p
keyword: freq=noraman
keyword: PBEPBE/SDD
title: #p freq=noraman PBEPBE/SDD
converged: YES YES NO NO
title: Mulliken charges:
elementType: S O O C C C C C C C C C C C H H H H H H H H H H H H
charge: 0.879673 -0.558498 -0.554667 -0.568693 -0.437648 -0.504262 0.033190 -0.283073 0.447048 -0.385084 -0.355250 -0.239952 -0.245742 -0.231624 0.289705 0.273246 0.266914 0.239892 0.250535 0.243863 0.263939 0.239316 0.238864 0.234118 0.229424 0.234767
chargesum: 0.00000
title: Mulliken charges with hydrogens summed into heavy atoms:
elementType: S O O C C C C C C C C C C C
charge: 0.879673 -0.558498 -0.554667 -0.005742 0.069157 -0.009864 0.033190 -0.019133 0.447048 -0.145768 -0.116386 -0.005834 -0.016318 0.003143
polarizability: 2.36864408e+02 -7.32221256e+00 1.48681061e+02 -3.20967790e+00 3.16050725e+00 8.77731315e+01
1716.lowfreq: -9.2573 -1.9916 -0.0020 -0.0004 0.0012 4.3576 24.5589 62.5937 91.6497
frequency: 24.4653 62.5888 91.6404 96.4929 158.1546 164.1545 171.3725 239.1363 258.8214 293.1625 320.1235 346.2924 404.7402 431.0474 449.1980 499.8506 517.8626 543.0936 591.5574 613.8904 696.4112 703.7281 769.0822 787.7319 803.9789 840.4683 847.9199 862.2906 891.8841 901.1841 913.7452 939.4229 980.0402 983.7580 990.0229 1000.8021 1006.5402 1028.3010 1059.7530 1090.5219 1096.5044 1148.4782 1175.8051 1196.7843 1212.7168 1228.2361 1247.4510 1293.8504 1317.4903 1343.1048 1363.1067 1393.6853 1417.5733 1441.0705 1446.2870 1460.2932 1485.3967 1582.4500 1609.9719 1667.5500 2972.9453 3022.9236 3033.5460 3058.4040 3068.7119 3088.7792 3127.3763 3134.1481 3148.0405 3162.0177 3164.4172 3178.8759
redmass: 4.0175 5.3732 5.0035 3.9511 5.4612 4.2082 3.5508 2.5547 5.5970 4.6905 4.7404 7.2599 2.7921 3.3616 8.2562 4.6446 2.5556 5.1006 3.6942 6.3658 1.7334 4.7512 1.7500 4.1261 7.7509 1.7762 1.4346 1.6451 2.5867 1.3854 4.7386 1.5482 1.4002 2.5441 3.9183 1.3380 1.9630 2.1802 2.7821 1.5710 1.2173 1.2944 1.0585 1.1176 1.2691 2.2317 1.2802 1.3077 1.5552 1.2408 1.7668 3.2866 1.1017 1.8967 1.1586 1.0870 2.2642 5.7140 5.9590 9.3962 1.0602 1.0661 1.0949 1.0584 1.0878 1.1030 1.0862 1.0882 1.0935 1.1111 1.0979 1.0962
irintensity: 1.7700 1.1239 2.7667 1.9363 1.1855 3.8667 3.2235 1.5837 3.3549 7.5234 5.4143 38.1017 0.6461 5.8604 14.6347 53.5234 20.9454 8.6436 17.3414 0.2113 50.9721 12.9713 45.7279 20.1854 59.6493 2.4339 4.7495 22.3584 8.0532 3.9333 58.6118 21.2255 0.8809 20.5722 11.7718 0.4110 7.0531 4.5371 5.6832 10.4358 3.1051 4.6704 0.2552 2.4533 3.8022 5.9049 3.9174 3.8640 2.9991 2.1533 0.6658 1.9445 11.9065 7.8548 7.1368 11.4056 13.5635 1.8382 0.2707 11.4015 12.6314 16.8222 13.1796 2.7908 0.1738 9.2251 3.5314 0.3237 21.4588 1.8252 35.7661 10.0195
temp: 298.150 k
press: 1.00000 atm
elementType: 16 8 8 6 6 6 6 6 6 6 6 6 6 6 1 1 1 1 1 1 1 1 1 1 1 1
symmnumber: 1
zpe: 530323.8 jmol-1
zpe.correction: 0.201990 hartree
zpe.thermalcorrener: 0.215196 hartree
zpe.thermalcorrenthalpy: 0.216140 hartree
zpe.thermalcorrgfe: 0.161137 hartree
zpe.sumelectzpe: -973.674805 hartree
zpe.sumelectthermal: -973.661599 hartree
zpe.sumelectthermalent: -973.660655 hartree
zpe.sumelectthermalfe: -973.715658 hartree
dipole: 3.6656 5.6393 -2.1216
dipole: 7.0526
quadrupole: -84.4058 -86.9248 -99.1034
quadrupole: -15.8283 7.9029 -1.0637
quadrupole: 5.7388 3.2199 -8.9587 -15.8283 7.9029 -1.0637
hfenergy: -973.876795 hartree
pointgroup: C01 [X(C11H12O2S1)]
dipole: -1.460788 -2.3435488 -0.2699545 debye
dipolederiv: 1.8015462 -0.0194267 0.051431 0.3685868 1.1486425 0.0343316 -0.1523316 0.0403336 1.1654888 -0.6421534 -0.0018295 0.000105 -0.1602699 -0.6318884 0.0685217 0.1367271 0.1768873 -0.6092329 -0.7805789 -0.0397875 -0.0600931 -0.0969949 -0.5450052 -0.0033692 -0.105454 -0.1382205 -0.6379317 -0.2134453 0.0381864 0.0200331 -0.0157972 -0.0471206 -0.0329799 0.0245957 -0.0134177 -0.0509324 0.0833502 0.0114507 0.024803 0.0351142 -0.0276769 0.0549809 0.0624011 -0.0630306 0.066693 -0.0678264 -0.0688668 0.0317581 0.084731 -0.0126911 0.0499332 0.0146222 0.0620561 0.1542841 -0.5808657 0.1542309 -0.03767 -0.1491324 0.0628867 -0.0785204 0.0634577 -0.0713061 -0.2491995 0.3715683 0.0009809 0.0135282 -0.0526543 -0.0501062 -0.005171 0.0431687 -0.0520992 -0.0647799 0.0160666 -0.0262992 0.0095145 -0.0059629 0.0037615 0.0090468 0.0158192 0.0216594 0.047553 -0.1063849 0.0919572 -0.0232647 -0.0484791 0.0520503 -0.0648113 0.0140079 -0.0628694 -0.12665 -0.0192496 -0.0418697 0.0294413 0.0128693 -0.0421892 -0.0382374 0.0154616 -0.0471908 -0.1279089 0.0258255 -0.1237 0.0526519 -0.1585783 0.0284344 -0.065292 0.0656794 -0.0672155 -0.1204557 -0.1574799 0.0770072 -0.0241167 0.1704155 0.0824407 -0.079905 -0.0638188 -0.0784526 -0.1219184 0.0390256 0.0395577 0.000621 -0.0352404 -0.0430173 -0.0371836 0.0214334 -0.0340263 -0.1373707 -0.0562227 -0.0088701 0.0091326 0.0334 0.0646084 0.0024558 -0.0031293 -0.0092881 0.0894935 0.0943606 0.0043668 -0.034268 0.0169202 -0.0050038 -0.0376561 -0.0276415 -0.0026687 -0.0595386 0.0198331 0.0111187 -0.037473 -0.051253 0.1071094 -0.048071 -0.0554048 0.0220657 -0.057089 0.0798592 -0.0178273 0.0069389 0.0733912 -0.1342891 -0.0264765 0.0111157 -0.0015616 0.0950578 -0.0050512 -0.0421404 0.069933 -0.0022355 0.0201797 0.0427948 0.0610827 0.0566225 -0.0334969 0.0078184 -0.0381533 -0.0541168 -0.0183633 -0.0258005 -0.0371196 -0.0727465 -0.0564942 -0.0046969 0.0766416 -0.0027955 -0.0039577 -0.0119939 0.0070705 0.0230046 -0.0158683 0.0433353 0.112987 0.0674031 -0.0902301 0.0246668 -0.0539959 -0.0308671 0.0594374 0.0137506 0.0594224 0.1322651 0.0516827 0.0909521 -0.0441182 0.0888186 -0.0024074 0.052068 -0.0439267 0.0569027 0.1161043 -0.0201973 0.0881499 -0.0373961 0.1087023 -0.0097522 0.0628475 -0.0467571 0.0620663 0.1359916 0.0399618 -0.0532111 0.0140164 -0.0938217 -0.0636511 0.0740958 0.025851 0.0752355 0.1311675 -0.1254876 -0.0329513 -0.0021007 -0.0381764 0.0942822 0.0212747 -0.0020955 0.0212542 0.1541157 unknown
polarizability: 236.5075529|-6.86694|143.3228338|7.4116914|-17.9061443|93.4882134 unknown
InChI: InChI=1S/C11H12O2S/c12-14(13)8-4-7-11(14)9-10-5-2-1-3-6-10/h1-3,5-6,9H,4,7-8H2
charge 0 multiplicity 1
26 atoms
S  2.727285 0.705686 -0.187465
O  2.690846 1.806507 -1.394988
O  3.353756 1.111691 1.272432
C  3.501749 -1.016234 -0.65015
C  2.750618 -1.938913 0.316034
C  1.218658 -1.589498 0.316258
C  1.004787 -0.126211 0.021283
C  -0.063601 0.672684 -0.222761
C  -1.499559 0.34889 -0.178664
C  -2.417049 1.366628 -0.573576
C  -2.02674 -0.911556 0.230672
C  -3.806983 1.136296 -0.567489
C  -3.417616 -1.139787 0.237719
C  -4.3142 -0.120466 -0.162223
H  4.581034 -0.92234 -0.467309
H  3.26465 -1.164589 -1.715393
H  3.163088 -1.80325 1.330995
H  2.89134 -2.995234 0.028894
H  0.785947 -1.865717 1.29611
H  0.696285 -2.188684 -0.456265
H  0.171102 1.708008 -0.519262
H  -2.027408 2.34244 -0.887819
H  -1.356836 -1.71114 0.556902
H  -4.493348 1.932354 -0.875429
H  -3.806607 -2.112416 0.558891
H  -5.394298 -0.30275 -0.154295
