program: Gaussian 09
title: 000284516
version: EM64L-G09RevD.01
frameworkgroup: C1[X(C11H11Cl)]
method: RPBEPBE
basis: SDD
operation: Freq
keyword: #p
keyword: freq=noraman
keyword: PBEPBE/SDD
title: #p freq=noraman PBEPBE/SDD
converged: YES YES NO NO
title: Mulliken charges:
elementType: Cl C C C C C C C C C C C H H H H H H H H H H H
charge: -0.088171 -0.356284 -0.456210 -0.573825 0.337567 0.066256 -0.393056 -0.394757 -0.219586 -0.220220 -0.244644 -0.137984 0.218881 0.234942 0.239711 0.254470 0.284752 0.265850 0.249319 0.245234 0.229203 0.228306 0.230245
chargesum: 0.00000
title: Mulliken charges with hydrogens summed into heavy atoms:
elementType: Cl C C C C C C C C C C C
charge: -0.088171 0.097540 0.037971 -0.023222 0.337567 0.066256 -0.143737 -0.149524 0.009617 0.008086 -0.014399 -0.137984
polarizability: 1.97832434e+02 1.45817862e+01 1.19750232e+02 1.93802741e+01 -9.01376146e+00 7.45142846e+01
1716.lowfreq: -14.6434 -0.0028 -0.0014 -0.0006 2.9699 8.4502 15.7282 25.7745 55.3225
frequency: 12.7534 25.3855 55.1339 78.6811 131.7249 163.0698 253.3563 292.9730 328.5169 382.9896 397.2268 402.5073 499.3013 518.7754 550.9655 602.9380 618.3842 691.3744 697.9185 774.6699 788.2755 853.5660 855.1161 928.2398 932.7011 980.2123 986.0883 989.8095 997.7785 1011.2204 1031.9959 1078.6168 1092.6059 1133.6124 1167.7365 1172.8272 1186.6133 1258.1678 1269.9294 1291.3421 1311.2195 1325.2428 1356.3174 1368.5060 1433.3454 1444.3487 1446.1104 1454.2132 1483.4277 1575.5301 1609.7210 2259.9617 2983.3487 2985.7759 3036.7383 3051.6487 3062.2247 3126.5918 3134.8797 3141.2561 3148.1338 3157.1168 3168.6398
redmass: 4.0405 9.6196 3.8204 5.5680 3.8689 3.7025 3.0295 3.2589 3.6457 4.3808 3.0013 2.8394 6.8122 3.3467 3.9145 4.5861 6.5738 4.4413 1.8425 1.7480 1.5820 2.5578 1.3226 1.4497 2.2417 1.3820 5.2980 1.9347 1.3203 2.2464 1.8799 1.5992 2.7364 1.1174 1.1236 1.0550 1.1108 1.1936 2.2545 1.3309 1.3945 1.4775 1.4589 5.4960 2.3609 1.0852 1.1008 1.0866 2.4331 5.7649 6.0879 11.8491 1.0586 1.0632 1.0993 1.0819 1.0744 1.0846 1.0880 1.1113 1.0928 1.0970 1.1017
irintensity: 0.3426 0.6802 2.2743 1.3540 4.2398 2.8117 3.6519 8.3807 1.3093 0.0776 3.7406 0.0048 0.8451 2.4423 12.3377 18.6002 0.0770 11.9498 44.0488 67.5475 23.3577 10.0268 1.1632 6.9558 4.0433 0.0026 0.6850 7.6128 0.2733 2.0810 5.9322 9.6714 2.4516 0.5161 1.0733 0.0096 0.0394 6.0317 2.4082 24.3366 0.0381 3.5429 12.9816 0.0109 6.2657 14.2106 7.8605 17.7272 28.9282 2.0386 11.6574 4.3484 18.8106 28.3381 14.1984 16.6953 32.6741 1.6080 3.2055 15.9551 20.4662 33.2438 16.7982
temp: 298.150 k
press: 1.00000 atm
elementType: 17 6 6 6 6 6 6 6 6 6 6 6 1 1 1 1 1 1 1 1 1 1 1
symmnumber: 1
zpe: 481792.4 jmol-1
zpe.correction: 0.183505 hartree
zpe.thermalcorrener: 0.195299 hartree
zpe.thermalcorrenthalpy: 0.196243 hartree
zpe.thermalcorrgfe: 0.142010 hartree
zpe.sumelectzpe: -884.916492 hartree
zpe.sumelectthermal: -884.904699 hartree
zpe.sumelectthermalent: -884.903754 hartree
zpe.sumelectthermalfe: -884.957987 hartree
dipole: 0.8892 -1.7689 1.2221
dipole: 2.3267
quadrupole: -73.6188 -73.0313 -78.4963
quadrupole: 9.3539 -0.4837 -1.6317
quadrupole: 1.4300 2.0175 -3.4475 9.3539 -0.4837 -1.6317
hfenergy: -885.0999972 hartree
pointgroup: C01 [X(C11H11Cl1)]
dipole: 0.3049566 0.6815856 -0.5294967 debye
dipolederiv: -0.3134218 -0.1425164 0.071456 -0.1853493 -0.4399851 0.0961142 0.1059098 0.1676553 -0.2996667 0.0250721 -0.0124289 0.0279478 -0.0168187 -0.048115 -0.0011428 0.2172091 0.0385645 0.0473603 0.1965666 -0.0097374 -0.0328436 -0.0427641 0.1352248 -0.0203095 -0.1014889 0.0040382 0.0767502 0.2913842 0.1775283 -0.1345143 0.3134197 0.4956807 -0.2299631 -0.2075408 -0.2416814 0.3105034 0.5349445 -0.0784584 -0.0457607 -0.1068184 0.0782171 0.0147388 -0.0723753 0.0180511 0.0792981 0.0278167 -0.0166732 -0.0379594 -0.0491196 -0.1379888 -0.0125484 -0.0934688 -0.0071355 -0.1726024 -0.1475299 0.0886026 -0.0438402 0.0886231 -0.0141867 -0.0618088 -0.0340689 -0.0659909 -0.1303399 -0.1898108 -0.040178 0.0039503 -0.0173876 0.0535285 -0.0556555 0.0064377 -0.0524498 -0.147747 -0.0375367 -0.0719722 0.0003526 -0.0981476 0.1041543 -0.0557124 0.0073635 -0.0572331 -0.1272388 0.0293114 0.0838594 -0.0607387 0.1115589 0.015981 -0.0706461 -0.0701862 -0.0679438 -0.1103403 -0.0045643 -0.0280295 -0.0370092 -0.0223657 -0.0626885 -0.0241006 -0.0275342 -0.0257918 -0.1533148 -0.2080419 -0.0192484 -0.0190833 -0.0007791 -0.1399084 0.0162408 0.0396386 0.0058459 -0.1068669 0.1135538 -0.0749657 0.0645986 -0.0754744 -0.0456356 0.0967791 0.010151 0.0430006 -0.0456031 -0.2083661 0.0904202 0.0029925 0.0364181 0.0581385 -0.0300442 -0.0384023 -0.0542278 0.0631706 -0.044178 0.0300395 0.0007644 0.0635616 -0.0984713 -0.0945221 0.0010082 -0.0728473 0.072204 -0.0411884 0.004121 0.0623033 0.0131343 0.0752103 0.1095248 0.0496894 0.0559696 0.0113185 -0.030399 0.0529412 0.0855631 0.049974 -0.0004294 0.0491714 0.1122188 0.0525191 0.0554311 -0.0051478 -0.0618357 -0.06609 -0.0902048 0.0205155 0.0290418 -0.0693673 0.0152322 -0.1029469 0.0283997 -0.0831225 0.0546001 -0.072202 0.0182878 0.0544062 0.0520417 0.0575824 0.125988 0.0813669 0.0729487 -0.0033686 0.0555655 -0.0541751 0.0511075 0.0007138 0.0477623 0.1398904 0.0453543 0.0672782 0.0023141 0.0933987 -0.0881888 0.0561194 -0.0031828 0.0588367 0.1411482 -0.0226096 -0.0813198 0.0606654 -0.1026501 -0.0077048 0.0705212 0.0703535 0.0675626 0.1239977 -0.1209759 0.052747 0.0436993 0.0544273 0.0825391 0.0126881 0.0448804 0.0126806 0.1496063 unknown
polarizability: 199.6577366|-10.4040973|116.4272357|-17.2813862|-13.3976596|76.0119787 unknown
InChI: InChI=1S/C11H11Cl/c12-10-6-2-5-9-11-7-3-1-4-8-11/h1,3-4,7-8H,2,6,10H2
charge 0 multiplicity 1
23 atoms
Cl -4.433624 -1.742954 0.121608
C  -3.603762 0.876615 -0.549981
C  -2.749586 1.064669 0.736767
C  -3.59477 -0.549293 -1.096662
C  1.254267 0.153634 0.148101
C  -1.323714 0.752798 0.53648
C  1.738665 -1.156479 0.435532
C  2.169651 1.130625 -0.342178
C  3.097685 -1.475932 0.237103
C  3.52756 0.804171 -0.5378
C  3.998024 -0.498928 -0.250024
C  -0.131145 0.479512 0.35005
H  -3.208215 1.538066 -1.347555
H  -4.64324 1.192613 -0.344279
H  -2.857357 2.109688 1.086681
H  -3.162776 0.414804 1.53265
H  -2.574688 -0.941135 -1.225297
H  -4.17404 -0.646448 -2.026607
H  1.0404 -1.910603 0.813925
H  1.803798 2.138991 -0.563375
H  3.456337 -2.486512 0.46223
H  4.220242 1.565024 -0.914596
H  5.053489 -0.749824 -0.402875
