program: Gaussian 09
title: 000284554
version: EM64L-G09RevD.01
frameworkgroup: C1[X(C15H21N3O6)]
method: RPBEPBE
basis: SDD
operation: Freq
keyword: #p
keyword: freq=noraman
keyword: PBEPBE/SDD
title: #p freq=noraman PBEPBE/SDD
converged: YES YES NO NO
title: Mulliken charges:
elementType: O O O O O O N N N C C C C C C C C C C C C C C C H H H H H H H H H H H H H H H H H H H H H
charge: -0.277976 -0.274798 -0.287002 -0.263346 -0.265847 -0.287202 -0.427003 -0.035699 -0.121439 -0.192056 -0.126524 -0.185159 0.343107 -0.360623 0.351998 -0.690805 -0.694204 -0.080755 -0.060166 0.183190 0.218332 -0.605378 -0.615775 -0.499478 0.331500 0.252986 0.279778 0.255855 0.218691 0.217324 0.216847 0.269070 0.243745 0.217082 0.218552 0.361946 0.217746 0.234327 0.265726 0.280820 0.225260 0.223127 0.231045 0.242397 0.250784
chargesum: 0.00000
title: Mulliken charges with hydrogens summed into heavy atoms:
elementType: O O O O O O N N N C C C C C C C C C C C C C C C
charge: -0.277976 -0.274798 -0.287002 -0.263346 -0.265847 -0.287202 -0.065056 -0.035699 -0.121439 0.139443 0.126461 0.094619 0.343107 0.113923 0.351998 0.012436 -0.014824 -0.080755 -0.060166 0.183190 0.218332 0.112421 0.113432 0.224749
polarizability: 2.71078274e+02 2.40344023e+00 1.92842506e+02 2.06120448e-01 4.36451757e+00 1.45770056e+02
1716.lowfreq: -10.1553 -0.0005 0.0001 0.0005 1.3266 7.3619 14.7651 20.2347 35.1420
frequency: 13.9053 19.2915 34.7327 44.0650 58.1491 65.9020 70.8552 81.4918 94.5635 102.6006 104.4771 116.1845 136.3254 151.4485 164.1735 173.8944 205.1401 217.1460 225.9796 236.1557 263.1520 270.9147 299.3293 306.5770 320.8116 340.4033 353.2127 359.9751 374.6621 397.7808 408.6837 431.2867 480.4754 486.1940 579.6773 592.2408 621.5266 635.1043 638.4996 680.5917 698.1612 717.6212 730.6945 736.1458 751.9720 761.4421 776.8368 812.2640 825.4019 847.8554 856.0235 885.8737 892.6526 919.4028 923.2026 935.2213 956.1700 985.7172 997.5287 1005.3834 1022.1960 1046.2460 1054.9656 1069.6662 1077.1151 1086.6307 1093.7505 1112.8666 1138.0437 1140.4693 1144.9916 1153.7600 1184.8543 1190.1178 1204.9253 1227.7799 1240.7635 1244.6934 1257.4633 1266.1485 1274.6795 1286.5817 1316.5819 1332.3909 1349.0061 1359.3040 1363.8948 1377.5281 1392.8245 1410.4959 1417.0008 1427.9432 1437.7089 1450.3817 1452.5078 1453.0482 1457.6181 1458.4293 1461.2344 1463.3596 1469.3481 1470.4862 1482.5396 1487.0445 1505.6462 1538.4959 1576.9919 1623.9403 2967.2230 2972.0019 2973.1521 2991.2642 3006.3417 3007.2750 3039.9926 3040.8857 3045.1586 3065.8569 3086.3555 3092.4479 3101.3760 3108.0429 3111.4441 3111.7675 3117.9814 3121.3837 3136.5008 3151.4696 3579.8409
redmass: 3.8826 5.1351 4.0656 3.4309 4.0949 2.8397 2.1090 2.1558 1.6556 3.1695 2.5235 3.9606 1.0946 4.6105 1.1511 3.4907 5.4789 3.8384 4.0920 1.0987 3.2068 3.5710 6.0127 5.5499 4.2726 3.0377 4.6915 3.7125 2.9724 3.3285 3.2181 5.0492 4.1764 7.2044 5.9614 6.6342 5.0914 6.9554 7.2233 8.1289 6.2183 4.4768 6.8961 8.5914 6.1344 1.7437 2.3046 5.6649 3.9054 4.6946 4.6611 3.2137 5.2429 5.8829 1.5852 3.1954 2.4186 1.3105 4.7753 3.8308 3.5011 2.7711 1.3882 4.1842 3.4701 2.8143 1.2491 1.2820 2.5532 1.8675 1.4257 1.6083 1.2138 1.6696 2.5824 1.6332 5.6780 2.1483 3.2822 1.7482 1.6138 2.1373 1.2214 1.3156 2.0340 3.9001 1.5484 1.2714 1.2346 1.2412 1.5039 1.8685 1.6137 1.0581 1.0579 1.0956 1.0786 1.5195 1.0516 1.1286 1.0629 1.1373 1.0481 1.0464 1.6295 6.6272 5.9921 10.5724 1.0365 1.0677 1.0372 1.0349 1.0356 1.0293 1.0853 1.1017 1.1015 1.0882 1.0896 1.0997 1.1010 1.0996 1.1048 1.0976 1.0975 1.1009 1.0950 1.1048 1.0818
irintensity: 2.3958 0.2297 0.8645 1.5626 1.2620 3.3528 2.0903 1.3740 0.7640 4.2599 2.0794 1.1854 0.0745 2.3863 0.2745 4.7509 2.4355 8.7756 2.8889 1.2189 3.4788 5.9273 11.2220 8.3701 4.8944 2.8031 22.3020 1.5211 0.0402 3.1745 8.7038 1.7953 12.2511 14.2195 0.3675 7.1451 4.2749 0.8736 6.0754 2.6286 24.5802 10.6095 4.6409 19.3667 17.1041 37.6126 31.9912 46.2747 38.7204 12.3931 15.0692 10.7398 6.2534 12.2832 2.0142 22.5027 4.5927 0.6296 109.1194 88.7559 114.7871 45.3999 4.8470 51.2373 97.3180 23.8895 0.7609 1.9287 177.9012 56.2898 14.5301 91.6818 2.1322 50.1725 76.8482 29.4658 52.2246 23.4428 75.6206 10.1469 23.3347 54.6687 0.8676 0.6831 7.1059 13.7867 19.5470 41.3710 33.1382 42.2221 1.8493 69.8268 39.5424 6.5156 12.6878 4.2488 12.9051 34.7731 14.0503 27.1622 0.1782 13.6322 11.1902 23.1512 49.1800 89.5280 295.5767 209.8398 28.8425 47.0802 125.9225 18.7799 16.8631 33.6220 2.8701 44.3505 23.4138 26.4740 21.7137 8.6929 7.4648 24.3946 19.4798 17.7106 1.7439 20.0252 11.5671 15.4507 123.1921
temp: 298.150 k
press: 1.00000 atm
elementType: 8 8 8 8 8 8 7 7 7 6 6 6 6 6 6 6 6 6 6 6 6 6 6 6 1 1 1 1 1 1 1 1 1 1 1 1 1 1 1 1 1 1 1 1 1
symmnumber: 1
zpe: 933418.4 jmol-1
zpe.correction: 0.355520 hartree
zpe.thermalcorrener: 0.380436 hartree
zpe.thermalcorrenthalpy: 0.381380 hartree
zpe.thermalcorrgfe: 0.298078 hartree
zpe.sumelectzpe: -1197.933331 hartree
zpe.sumelectthermal: -1197.908416 hartree
zpe.sumelectthermalent: -1197.907471 hartree
zpe.sumelectthermalfe: -1197.990774 hartree
dipole: -1.2092 -1.8293 -2.9364
dipole: 3.6648
quadrupole: -124.1091 -134.2117 -142.6739
quadrupole: -3.4497 9.6360 -3.4459
quadrupole: 9.5558 -0.5468 -9.0090 -3.4497 9.6360 -3.4459
hfenergy: -1198.2888515 hartree
pointgroup: C01 [X(C15H21N3O6)]
dipole: 0.3909046 0.0775641 -1.3856808 debye
polarizability: 270.1674475|5.8612492|177.9882076|-6.565442|-22.9294895|161.5351809 unknown
InChI: InChI=1S/C15H21N3O6/c1-15(2)23-7-6-22-12(11(7)24-15)9-8(14(20)21-5)10(17-16-9)13(19)18(3)4/h7,11-12,16H,6H2,1-5H3
charge 0 multiplicity 1
45 atoms
O  -3.306401 -1.383205 0.238855
O  -4.471754 0.507594 1.027867
O  -2.268182 1.313163 -1.23206
O  2.365714 -2.089373 0.404759
O  0.27485 -1.922762 1.413469
O  3.735697 0.485392 1.369111
N  0.379571 1.577339 -1.263079
N  1.746017 1.779412 -1.151202
N  4.632599 0.775201 -0.768797
C  -2.27441 -0.375009 0.517248
C  -3.052592 0.889518 1.023399
C  -1.549748 0.087416 -0.778813
C  -4.648281 -0.737945 0.229893
C  -2.712111 2.002308 0.012492
C  -0.076793 0.436756 -0.637028
C  -5.089693 -0.409575 -1.204658
C  -5.614241 -1.649234 0.982846
C  1.077214 -0.177217 -0.094922
C  2.174864 0.693253 -0.436856
C  1.157896 -1.445139 0.6538
C  3.573972 0.631901 0.113617
C  4.51733 0.845296 -2.233278
C  5.999414 0.836085 -0.225635
C  2.631033 -3.292065 1.228383
H  -1.574659 -0.81973 1.239736
H  -2.798983 1.175011 2.056967
H  -1.693932 -0.671437 -1.567979
H  -3.587383 2.615613 -0.248393
H  -1.893355 2.644041 0.398454
H  -5.183861 -1.342256 -1.788107
H  -6.071504 0.095375 -1.18666
H  -4.356886 0.249669 -1.699616
H  -5.228693 -1.843551 1.996044
H  -6.605441 -1.170565 1.05855
H  -5.722125 -2.608784 0.449217
H  -0.213608 2.234912 -1.770882
H  5.216237 0.119754 -2.692337
H  4.766854 1.858049 -2.603924
H  3.495058 0.605779 -2.554334
H  5.939343 0.806345 0.872741
H  6.49824 1.770476 -0.546037
H  6.598644 -0.024597 -0.580524
H  3.590301 -3.678304 0.857263
H  1.82267 -4.031156 1.100226
H  2.704117 -3.006252 2.290784
