program: Gaussian 09
title: 000284510
version: EM64L-G09RevD.01
frameworkgroup: C1[X(C12H19NO2S)]
method: RPBEPBE
basis: SDD
operation: Freq
keyword: #p
keyword: freq=noraman
keyword: PBEPBE/SDD
title: #p freq=noraman PBEPBE/SDD
converged: NO YES NO NO
title: Mulliken charges:
elementType: S O O N C C C C C C C C C C C C H H H H H H H H H H H H H H H H H H H
charge: 0.994312 -0.557831 -0.558068 -0.720111 -0.393208 -0.295619 -0.569962 0.389332 -0.602253 0.290274 -0.585041 0.451181 -0.407288 -0.408471 -0.840272 -0.816740 0.221580 0.213975 0.236153 0.235398 0.213953 0.218317 0.278611 0.278995 0.237318 0.226572 0.229534 0.234230 0.231536 0.225616 0.223709 0.223392 0.235141 0.332997 0.332735
chargesum: 0.00000
title: Mulliken charges with hydrogens summed into heavy atoms:
elementType: S O O N C C C C C C C C C C C C
charge: 0.994312 -0.557831 -0.558068 -0.054378 0.042348 0.175932 -0.137691 0.389332 -0.044647 0.290274 -0.347723 0.451181 -0.180716 -0.178937 -0.148890 -0.134497
polarizability: 2.24142625e+02 8.99083197e+00 1.73570294e+02 -9.07677046e+00 5.02084490e+00 1.21372267e+02
1716.lowfreq: -5.1324 0.0010 0.0017 0.0021 6.9716 16.1508 22.4163 23.8329 43.3232
frequency: 21.3689 23.6075 43.2176 44.2323 50.3758 89.0795 99.9828 120.5208 130.2475 151.9701 161.4810 167.8340 190.4354 242.4527 269.5345 277.1967 287.5962 292.8991 313.2557 334.8353 359.9706 399.4448 435.0465 460.1198 464.4596 503.1593 559.0526 603.8663 618.9061 712.4675 731.9502 752.6853 757.9814 789.6314 805.8559 822.2556 828.9390 879.0306 898.7323 911.4043 922.5523 955.4178 989.7752 1005.8389 1011.4093 1027.4597 1036.5392 1042.5140 1047.8322 1068.5430 1074.2474 1111.9108 1140.4772 1167.9203 1216.2775 1229.3316 1237.2111 1258.0050 1279.7640 1286.1573 1292.6077 1298.6769 1335.1245 1347.3961 1370.2331 1396.9809 1399.4964 1408.5957 1409.9535 1464.3170 1469.1531 1473.5830 1476.0704 1476.9004 1483.2842 1492.5251 1501.3278 1538.6500 1585.3090 1624.6996 2970.7052 2972.3537 2977.7126 2986.7878 2995.6367 3021.0811 3043.3676 3045.0843 3051.9985 3052.8227 3064.0087 3080.4208 3081.3086 3100.1463 3110.7295 3136.0082 3143.0061 3349.3681 3511.6407
redmass: 4.9809 5.5765 2.1975 1.2952 4.1292 6.6382 2.0216 2.5146 1.7543 1.2956 1.6890 4.7781 4.6456 2.8035 3.0950 2.0641 3.3208 4.8318 2.8402 3.6394 4.1936 6.6772 2.8136 3.4692 3.0541 4.4400 3.8131 5.1317 4.2797 4.0075 2.8527 1.6879 1.8156 1.2645 3.3885 1.2775 2.1992 2.0349 1.4176 2.0469 2.4912 1.3492 1.8169 1.3744 3.4178 1.3339 3.1887 1.6820 1.5529 3.0989 1.5695 1.4916 1.6361 1.5298 1.7502 1.2027 1.4738 3.0816 1.3005 1.3022 1.0633 1.2803 1.3613 1.4194 5.4578 1.2309 1.2748 1.1506 2.6297 1.0849 1.0655 1.0531 1.0919 1.0840 1.1058 1.1255 2.7652 1.0856 5.9059 6.5064 1.0379 1.0385 1.0588 1.0598 1.0587 1.0999 1.1006 1.0999 1.0560 1.0951 1.1050 1.0981 1.0996 1.0910 1.0869 1.0969 1.1105 1.0418 1.0993
irintensity: 1.3280 1.8624 0.1468 1.0414 0.6686 5.0692 0.7601 0.9221 1.1903 0.6377 42.4586 0.7669 4.7550 7.2218 8.4074 4.3606 10.1908 1.0592 0.2449 15.2898 17.8861 27.5451 0.2327 15.7030 9.8933 155.5257 7.3602 5.6758 0.3047 0.3208 1.2198 3.8026 3.7868 0.0646 10.2430 31.0644 178.8256 23.0512 6.5289 36.0335 3.8153 0.4123 7.3302 2.2533 2.7033 2.8304 1.8393 4.3367 24.3170 3.8601 9.9366 17.6753 8.3109 4.5486 0.2767 6.6934 0.0819 0.0904 15.7884 4.6737 0.0070 0.3544 13.0276 6.3735 0.0982 12.9273 5.3633 5.9023 2.9622 3.2063 3.6725 10.2751 20.3867 5.1311 19.7708 20.2135 27.7979 23.6197 3.0331 7.8640 43.0376 32.6869 0.8676 29.7948 31.9046 0.5603 16.5268 17.1108 6.9606 23.7694 38.9529 21.2045 20.0857 24.7326 13.2980 31.2651 2.4530 26.0716 22.8265
temp: 298.150 k
press: 1.00000 atm
elementType: 16 8 8 7 6 6 6 6 6 6 6 6 6 6 6 6 1 1 1 1 1 1 1 1 1 1 1 1 1 1 1 1 1 1 1
symmnumber: 1
zpe: 755174.6 jmol-1
zpe.correction: 0.287631 hartree
zpe.thermalcorrener: 0.306833 hartree
zpe.thermalcorrenthalpy: 0.307777 hartree
zpe.thermalcorrgfe: 0.237407 hartree
zpe.sumelectzpe: -1070.533790 hartree
zpe.sumelectthermal: -1070.514589 hartree
zpe.sumelectthermalent: -1070.513644 hartree
zpe.sumelectthermalfe: -1070.584014 hartree
dipole: -2.0178 -0.4025 3.1480
dipole: 3.7608
quadrupole: -105.2076 -104.0755 -110.3262
quadrupole: -1.4393 15.6588 0.0620
quadrupole: 1.3289 2.4609 -3.7898 -1.4393 15.6588 0.0620
hfenergy: -1070.821421 hartree
pointgroup: C01 [X(C12H19N1O2S1)]
dipole: -0.8223936 -0.1560244 1.2200517 debye
polarizability: 224.6380628|8.4788759|173.387133|-6.715714|5.4676838|121.0599896 unknown
InChI: InChI=1S/C12H19NO2S/c1-10-6-7-11(2)12(9-10)5-3-4-8-16(13,14)15/h6-7,9H,3-5,8,13H2,1-2H3
charge 0 multiplicity 1
35 atoms
S  4.788806 -0.242637 0.122101
O  4.98063 -1.554236 -0.826735
O  5.128543 1.261967 -0.40551
N  5.757967 -0.524888 1.677205
C  0.541276 -0.037869 0.178107
C  2.000315 -0.031781 -0.345577
C  -0.485033 0.167416 -0.972521
C  -1.923873 0.172229 -0.471401
C  2.983691 -0.250367 0.802701
C  -2.551313 1.370556 -0.012312
C  -2.641066 -1.048771 -0.420121
C  -3.96617 -1.133663 0.073957
C  -3.875252 1.286364 0.485672
C  -4.574011 0.060164 0.534296
C  -1.844866 2.716517 -0.063774
C  -4.719476 -2.453243 0.080032
H  0.323857 -0.998325 0.685654
H  0.409857 0.757598 0.93825
H  2.213701 0.934251 -0.842486
H  2.126243 -0.829939 -1.102455
H  -0.246793 1.113748 -1.494892
H  -0.348651 -0.646457 -1.711051
H  2.996083 0.558713 1.550051
H  2.90376 -1.236996 1.285939
H  -2.149261 -1.96222 -0.78241
H  -4.367203 2.199833 0.84255
H  -5.597601 0.031404 0.927961
H  -1.621276 3.021111 -1.104671
H  -2.472133 3.505823 0.384838
H  -0.881891 2.705702 0.480737
H  -4.03977 -3.309593 0.238243
H  -5.487799 -2.476423 0.87305
H  -5.238023 -2.621307 -0.884317
H  6.38148 0.290915 1.809977
H  6.285451 -1.408298 1.562013
