program: Gaussian 09
title: 000284509
version: EM64L-G09RevD.01
frameworkgroup: C1[X(C16H14S2)]
method: RPBEPBE
basis: SDD
operation: Freq
keyword: #pfreq=noraman
keyword: PBEPBE/SDD
title: #p freq=noraman PBEPBE/SDD
converged: YES YES NO NO
title: Mulliken charges:
elementType: S S C C C C C C C C C C C C C C C C H H H H H H H H H H H H H H
charge: 0.266808 0.266815 0.479692 0.479667 -0.807313 -0.807327 -0.367216 -0.367084 -0.371502 -0.371627 -0.217480 -0.217504 -0.217325 -0.217302 -0.234219 -0.234215 -0.256151 -0.256356 0.277956 0.281711 0.277890 0.281764 0.238707 0.238714 0.236589 0.236606 0.229413 0.229418 0.229002 0.228995 0.231437 0.231437
chargesum: 0.00000
title: Mulliken charges with hydrogens summed into heavy atoms:
elementType: S S C C C C C C C C C C C C C C C C
charge: 0.266808 0.266815 0.479692 0.479667 -0.247645 -0.247672 -0.128509 -0.128370 -0.134914 -0.135021 0.011933 0.011914 0.011677 0.011693 -0.002782 -0.002778 -0.256151 -0.256356
polarizability: 4.47666977e+02 -6.30574509e-02 1.50796138e+02 8.75693047e+00 -5.20410434e-02 1.36296961e+02
1716.lowfreq: -11.9591 -0.0028 -0.0021 -0.0016 1.5274 2.1090 10.7297 17.7001 21.5787
frequency: 10.6349 17.4588 21.2744 33.3472 36.7940 47.1801 69.4427 78.2278 104.5956 204.7444 239.7847 240.1440 246.5556 325.7841 327.2917 349.5497 349.7492 402.0596 402.0780 435.2051 460.6305 460.8007 538.9259 540.5418 616.5523 616.6284 617.4337 622.0203 700.8614 700.9794 773.0661 773.8423 809.2597 809.9101 851.3422 851.5211 878.6233 883.1240 890.5181 926.7329 927.0028 977.9576 978.0245 989.3738 989.3837 997.5594 997.5844 1026.1762 1026.2989 1065.6215 1066.2615 1114.6807 1115.1132 1173.8048 1173.8814 1187.9926 1188.2449 1210.0388 1211.9619 1226.5072 1227.8607 1325.6092 1325.8671 1385.3451 1385.4165 1440.9050 1441.0758 1455.3311 1455.9298 1483.6552 1483.7331 1592.1939 1592.2725 1612.4321 1612.5613 2098.1479 3049.0552 3049.1306 3122.8071 3122.8440 3124.4829 3124.4889 3131.5478 3131.6235 3137.4756 3137.4969 3149.5933 3149.6196 3166.0241 3166.0968
redmass: 5.4883 4.5245 3.9465 4.4522 5.9526 7.3595 5.5439 6.0852 7.5537 7.1827 5.5600 6.6978 10.8716 2.2862 2.2685 11.0553 10.8001 2.7989 2.7988 23.7347 4.1235 4.1092 6.0455 6.0365 6.1457 6.3023 4.4739 4.4501 1.6806 1.6696 2.0985 2.1210 3.9272 3.9174 1.2524 1.2518 1.4729 1.4872 13.5348 1.4469 1.4530 1.3916 1.3917 6.1613 6.1630 1.3253 1.3252 2.1910 2.1923 1.4073 1.4096 1.1425 1.1394 1.0525 1.0524 1.1131 1.1135 1.1468 1.1737 3.1695 2.9908 1.2810 1.2804 8.8449 8.8508 2.2104 2.2108 1.1251 1.1258 2.3603 2.3581 6.0574 6.0571 6.1060 6.0956 11.9463 1.0572 1.0572 1.0856 1.0856 1.0888 1.0889 1.1094 1.1095 1.0919 1.0919 1.0964 1.0964 1.1017 1.1017
irintensity: 0.2186 0.0611 0.0085 0.5398 0.3560 0.0918 0.2993 0.5099 0.9513 1.9120 1.7444 5.6895 6.9029 1.5819 1.4265 1.5527 2.0493 0.0016 0.0019 0.0396 7.8671 6.9120 3.6958 23.6892 2.0403 0.2681 17.3792 13.1207 63.6357 52.3200 36.4376 27.5998 6.4174 7.6276 0.0234 0.0173 0.3487 0.6012 0.0557 2.1117 2.9202 0.0081 0.0083 0.7187 0.1179 0.0472 0.0567 13.7650 3.1150 5.9998 7.4315 3.4948 3.7830 0.0266 0.0264 3.4740 1.9643 3.7433 19.5490 0.5009 13.8393 0.2194 0.2203 0.1966 0.2296 8.7751 8.9117 3.5700 8.9089 30.7281 5.0402 0.9818 1.0076 6.7956 0.6814 4.4946 12.0647 7.8170 11.2322 3.5571 0.9081 0.7152 4.5434 4.7239 14.9048 9.7866 37.8517 38.9830 57.9147 1.1458
temp: 298.150 k
press: 1.00000 atm
elementType: 16 16 6 6 6 6 6 6 6 6 6 6 6 6 6 6 6 6 1 1 1 1 1 1 1 1 1 1 1 1 1 1
symmnumber: 1
zpe: 643527.0 jmol-1
zpe.correction: 0.245106 hartree
zpe.thermalcorrener: 0.263041 hartree
zpe.thermalcorrenthalpy: 0.263985 hartree
zpe.thermalcorrgfe: 0.192822 hartree
zpe.sumelectzpe: -1412.885698 hartree
zpe.sumelectthermal: -1412.867764 hartree
zpe.sumelectthermalent: -1412.866819 hartree
zpe.sumelectthermalfe: -1412.937983 hartree
dipole: 0.0028 2.3904 -0.0089
dipole: 2.3904
quadrupole: -88.0211 -119.7549 -119.4582
quadrupole: -0.0406 -2.9573 -0.0103
quadrupole: 21.0570 -10.6768 -10.3802 -0.0406 -2.9573 -0.0103
hfenergy: -1413.1308045 hartree
pointgroup: C01 [X(C16H14S2)]
dipole: -0.0020735 -0.9403121 0.0160693 debye
polarizability: 447.6606342|-0.5513531|150.7928569|-8.8516308|-0.2401519|136.3065857 unknown
InChI: InChI=1S/C16H14S2/c1-3-7-15(8-4-1)13-17-11-12-18-14-16-9-5-2-6-10-16/h1-10H,13-14H2
charge 0 multiplicity 1
32 atoms
S  -2.257966 1.382581 0.602118
S  2.262476 1.353122 -0.66017
C  -4.514384 -0.073529 -0.321217
C  4.513565 -0.076429 0.316064
C  -3.04384 0.041815 -0.603566
C  3.041111 0.045102 0.585552
C  -5.446297 0.767252 -0.986004
C  5.440194 0.782862 0.964387
C  -4.99673 -1.014034 0.627423
C  5.003154 -1.0414 -0.603844
C  -6.828381 0.66448 -0.715591
C  6.824163 0.674371 0.706244
C  -6.378556 -1.118833 0.898449
C  6.386908 -1.151842 -0.86266
C  -7.29866 -0.279786 0.227103
C  7.301686 -0.29423 -0.207694
C  -0.59998 1.320982 0.132638
C  0.603846 1.313259 -0.19064
H  -2.486144 -0.884484 -0.399815
H  -2.820303 0.409026 -1.61646
H  2.48534 -0.886739 0.402922
H  2.810755 0.43897 1.586832
H  -5.084141 1.501895 -1.715354
H  5.072317 1.536453 1.671187
H  -4.285329 -1.663334 1.152042
H  4.295923 -1.705211 -1.115788
H  -7.536662 1.316818 -1.23828
H  7.528297 1.341179 1.216123
H  -6.73745 -1.851885 1.62941
H  6.751394 -1.903684 -1.571435
H  -8.37114 -0.360991 0.436242
H  8.375633 -0.379855 -0.407322
