program: Gaussian 09
title: 000284507
version: EM64L-G09RevD.01
frameworkgroup: C1[X(C12H16O3S)]
method: RPBEPBE
basis: SDD
operation: Freq
keyword: #p
keyword: freq=noraman
keyword: PBEPBE/SDD
title: #p freq=noraman PBEPBE/SDD
converged: YES YES NO NO
title: Mulliken charges:
elementType: S O O O C C C C C C C C C C C C H H H H H H H H H H H H H H H H
charge: 0.955193 -0.568080 -0.568674 -0.194376 -0.303581 -0.364386 -0.630262 0.457666 0.200615 -0.738803 -0.444088 -0.371245 -0.788018 -0.220820 -0.234766 -0.242992 0.222203 0.274155 0.254528 0.263157 0.277735 0.263228 0.293653 0.258824 0.235826 0.262378 0.259759 0.252308 0.241799 0.230044 0.233140 0.233882
chargesum: 0.00000
title: Mulliken charges with hydrogens summed into heavy atoms:
elementType: S O O O C C C C C C C C C C C C
charge: 0.955193 -0.568080 -0.568674 -0.194376 -0.081378 0.164298 -0.089370 0.457666 0.200615 0.076901 -0.208262 -0.108868 -0.034152 0.009224 -0.001625 -0.009111
polarizability: 1.64885253e+02 -1.40689971e+01 1.68875561e+02 -2.96738673e+00 -1.69737424e+00 1.48869074e+02
1716.lowfreq: -9.7339 -6.8567 -5.5244 -0.0009 0.0009 0.0013 9.7479 16.5463 32.6532
frequency: 7.5270 16.3745 32.5962 40.1440 54.7785 69.5663 96.4879 120.2424 127.2422 142.5693 166.3141 190.2334 219.3471 238.8861 261.5215 294.0913 322.4721 342.9585 346.2552 404.0771 428.8536 470.8562 537.1356 569.0571 586.9969 598.4743 616.5328 624.9394 707.1086 742.0351 768.0957 790.6323 797.5246 857.5832 861.3018 879.3070 928.6453 939.2133 948.2395 963.7312 981.1140 989.4029 999.7376 1000.6227 1022.1005 1029.8605 1054.9306 1067.2334 1081.3501 1133.6467 1169.3260 1174.1962 1187.5538 1192.0621 1220.5499 1245.0562 1273.2192 1293.5663 1307.2910 1336.3819 1340.1802 1369.2697 1381.4418 1404.6788 1411.6578 1424.7644 1441.0721 1443.1757 1454.6469 1472.5673 1480.2712 1590.9005 1606.9437 1637.1651 2979.9728 2990.5960 3013.9147 3027.2756 3034.9173 3065.9697 3078.9544 3114.7378 3123.6655 3127.6765 3128.2953 3137.9582 3148.9854 3166.1307 3176.7350 3179.5864
redmass: 5.4337 5.3835 3.8466 4.4102 4.1966 4.5542 3.7904 1.0531 1.0955 3.4738 4.9447 2.8104 4.2313 3.7177 3.6263 6.0006 3.9066 5.8587 6.1478 2.8279 4.3373 3.6595 3.5388 5.3209 3.9816 5.0140 5.6019 3.2819 1.7856 2.0167 2.0219 4.8255 1.9609 1.2685 3.1027 2.9068 1.4544 1.9393 1.4729 1.4070 1.3958 5.6517 1.8914 1.3616 2.1265 1.9440 2.7371 2.7152 1.5514 1.4645 1.8200 1.1019 2.1470 1.1640 1.3478 1.5299 1.2908 1.1497 1.3063 1.2926 1.3412 1.2423 7.4939 1.0819 1.0861 1.0550 2.0657 1.0816 1.0611 1.0852 2.2071 6.0106 5.9657 8.1344 1.0396 1.0819 1.0606 1.0252 1.0545 1.0948 1.1018 1.0879 1.1003 1.0981 1.0985 1.0913 1.0959 1.1014 1.1070 1.1076
irintensity: 3.9553 1.7747 0.2708 6.2127 0.9667 2.1346 1.3884 0.6432 0.4083 11.2978 1.0829 0.3571 1.3460 9.5779 1.5270 14.2542 0.8431 4.9434 46.6496 0.0325 3.1303 1.6583 29.6368 12.9050 8.4629 26.1266 0.3258 6.3292 52.7846 15.5043 27.2917 39.8289 11.1468 0.7458 8.0156 40.5257 3.8041 17.7081 31.6507 30.0841 0.0292 1.5718 8.4295 0.6084 3.1182 18.4362 3.1539 3.4107 22.6112 17.4081 45.8299 3.7671 2.5923 0.4415 48.4676 29.4391 31.4447 4.2265 20.3888 1.3108 4.7824 63.3937 0.3229 8.3709 6.5358 13.6289 8.4066 20.5159 16.0239 15.1608 20.3097 3.6461 12.7120 100.8751 0.7079 22.3823 2.3441 1.2321 9.1837 9.8361 4.2787 8.0572 12.1463 2.8519 1.5570 10.4231 25.1700 21.3038 1.1715 1.5898
temp: 298.150 k
press: 1.00000 atm
elementType: 16 8 8 8 6 6 6 6 6 6 6 6 6 6 6 6 1 1 1 1 1 1 1 1 1 1 1 1 1 1 1 1
symmnumber: 1
zpe: 662870.3 jmol-1
zpe.correction: 0.252474 hartree
zpe.thermalcorrener: 0.270731 hartree
zpe.thermalcorrenthalpy: 0.271675 hartree
zpe.thermalcorrgfe: 0.201523 hartree
zpe.sumelectzpe: -1089.230075 hartree
zpe.sumelectthermal: -1089.211818 hartree
zpe.sumelectthermalent: -1089.210874 hartree
zpe.sumelectthermalfe: -1089.281026 hartree
dipole: 4.2261 -4.9345 -5.2008
dipole: 8.3221
quadrupole: -110.8381 -100.7744 -104.9376
quadrupole: 12.7183 3.4911 -4.9756
quadrupole: -5.3214 4.7423 0.5791 12.7183 3.4911 -4.9756
hfenergy: -1089.4825492 hartree
pointgroup: C01 [X(C12H16O3S1)]
dipole: 1.9678494 -1.2803948 -2.2821648 debye
polarizability: 170.0152851|-13.2955009|163.9700778|-4.8557313|0.1921685|148.6445244 unknown
InChI: InChI=1S/C12H16O3S/c1-10(13)12(8-9-16(2,14)15)11-6-4-3-5-7-11/h3-7,12H,8-9H2,1-2H3
charge 0 multiplicity 1
32 atoms
S  -3.560828 -0.683417 -0.040052
O  -3.418315 -0.98546 1.56221
O  -4.578472 0.46975 -0.601839
O  0.340755 2.703356 1.606935
C  0.204431 1.274199 -0.382307
C  -1.230126 0.907785 0.088491
C  -1.785695 -0.264859 -0.716725
C  1.197111 0.107098 -0.256642
C  0.753228 2.470544 0.442648
C  -4.027331 -2.337114 -0.898135
C  1.891094 -0.380118 -1.392997
C  1.435865 -0.498296 1.005544
C  1.819722 3.319691 -0.230628
C  2.801592 -1.455571 -1.276126
C  2.344066 -1.573161 1.122623
C  3.02973 -2.056407 -0.016926
H  0.178603 1.585677 -1.445832
H  -1.215313 0.658236 1.16396
H  -1.88806 1.789605 -0.025571
H  -1.964393 -0.039543 -1.781225
H  -1.208141 -1.194125 -0.584532
H  -3.304309 -3.093416 -0.562798
H  -5.044127 -2.55362 -0.542279
H  -4.002381 -2.163016 -1.982969
H  1.715684 0.080339 -2.373641
H  0.917897 -0.122968 1.895932
H  2.303607 3.98273 0.502909
H  2.577003 2.682744 -0.722505
H  1.352387 3.942396 -1.018858
H  3.328815 -1.823162 -2.163635
H  2.519807 -2.030653 2.102515
H  3.734995 -2.889542 0.076255
