program: Gaussian 09
title: 000284504
version: EM64L-G09RevD.01
frameworkgroup: C1[X(C7H10O4S3)]
method: RPBEPBE
basis: SDD
operation: Freq
keyword: #p
keyword: freq=noraman
keyword: PBEPBE/SDD
title: #p freq=noraman PBEPBE/SDD
converged: NO YES NO NO
title: Mulliken charges:
elementType: S S S O O O O C C C C C C C H H H H H H H H H H
charge: 0.928883 0.971394 0.379888 -0.568306 -0.539900 -0.555954 -0.592322 -0.570244 -0.581507 -0.467420 -0.750400 -0.077165 -0.124372 -0.496947 0.333941 0.314972 0.315986 0.314278 0.288341 0.334281 0.264692 0.342876 0.261041 0.273965
chargesum: 0.00000
title: Mulliken charges with hydrogens summed into heavy atoms:
elementType: S S S O O O O C C C C C C C
charge: 0.928883 0.971394 0.379888 -0.568306 -0.539900 -0.555954 -0.592322 0.078668 0.048757 -0.467420 0.136915 0.265711 0.136669 -0.222982
polarizability: 2.03917730e+02 -5.79014397e+00 1.50121992e+02 -5.72862426e+00 -6.13575741e+00 1.04670851e+02
1716.lowfreq: -15.9432 -0.0008 0.0009 0.0018 3.2155 7.6946 37.1809 49.8372 71.1367
frequency: 37.1535 49.7636 71.0559 86.9582 100.8282 124.7491 152.6214 170.7804 178.5215 192.5825 218.9381 237.2241 247.0838 255.0159 302.0236 318.5123 323.7115 353.6966 394.9471 439.8639 467.7844 489.1869 530.8762 560.5618 577.3297 602.6545 682.7213 715.9629 774.9997 789.1821 816.4955 840.1448 848.5165 868.0872 888.6058 918.4980 931.9101 942.6997 992.3665 1024.3010 1046.6464 1061.5020 1098.5017 1111.3409 1136.7346 1221.0037 1232.2065 1269.3826 1305.5474 1333.9229 1387.3053 1392.7871 1414.0713 1429.1082 1436.2180 1516.0862 3014.0298 3026.4859 3039.0020 3126.8559 3130.6725 3145.0243 3165.9373 3177.6803 3187.9124 3234.1218
redmass: 7.3533 5.3382 8.8775 6.7672 4.6231 8.0842 3.6617 2.7720 1.7342 8.6330 3.4829 2.8771 5.0151 4.4153 6.5831 8.3411 6.6971 7.2950 4.0263 5.2899 5.5822 4.2298 8.8365 3.3994 6.9111 11.3262 7.2860 1.1830 6.9117 12.7620 4.8644 1.8795 1.9632 1.2482 4.0341 5.3994 5.3783 1.4610 1.3267 1.4733 2.1274 1.7528 1.1078 1.0581 1.4676 1.2322 1.3464 1.2018 1.1312 2.2716 1.0898 1.1098 1.0505 1.0545 7.7841 4.9516 1.0247 1.0562 1.0569 1.1084 1.1095 1.0971 1.1087 1.1072 1.0937 1.1006
irintensity: 1.3337 3.9320 11.8615 1.1618 13.1282 0.5289 5.1377 5.5963 0.6335 0.3772 11.2376 0.8519 3.9212 6.1590 18.2745 25.8046 13.5995 5.6829 17.8495 5.9503 19.7244 25.1306 71.6452 11.3178 22.8369 2.6775 6.5551 105.4877 8.4546 108.6099 12.5174 18.6545 4.5197 11.3784 80.5766 88.4727 78.8037 4.2921 16.9246 82.5241 21.1663 3.2402 2.3888 4.1551 1.8709 4.1777 58.1750 0.9196 16.9765 4.5516 47.8979 17.1470 3.4175 10.6881 19.4570 1.8406 14.2406 8.3840 0.5498 6.0901 4.7788 56.7875 13.0024 0.4904 7.8579 0.1377
temp: 298.150 k
press: 1.00000 atm
elementType: 16 16 16 8 8 8 8 6 6 6 6 6 6 6 1 1 1 1 1 1 1 1 1 1
symmnumber: 1
zpe: 425625.4 jmol-1
zpe.correction: 0.162112 hartree
zpe.thermalcorrener: 0.178551 hartree
zpe.thermalcorrenthalpy: 0.179496 hartree
zpe.thermalcorrgfe: 0.117621 hartree
zpe.sumelectzpe: -1766.386674 hartree
zpe.sumelectthermal: -1766.370234 hartree
zpe.sumelectthermalent: -1766.369290 hartree
zpe.sumelectthermalfe: -1766.431164 hartree
dipole: 1.2864 -1.0269 -0.2717
dipole: 1.6683
quadrupole: -103.6434 -112.5134 -105.7279
quadrupole: -21.4989 -10.9424 -9.0899
quadrupole: 3.6515 -5.2185 1.5670 -21.4989 -10.9424 -9.0899
hfenergy: -1766.5487859 hartree
pointgroup: C01 [X(C7H10O4S3)]
dipole: -0.5221733 0.3180899 0.2386308 debye
dipolederiv: 1.752884 -0.1467917 -0.169604 -0.2501182 1.281607 0.1275566 -0.2884501 0.0945492 1.243137 1.5313645 0.0856891 0.0811282 0.0518634 1.1174634 0.0285322 0.0991235 0.0679641 1.0731546 0.070302 -0.0529035 -0.0957004 0.0096023 0.0766111 -0.1865976 -0.049382 -0.1728468 -0.0441104 -0.8657265 0.1056667 -0.0389824 0.0836049 -0.5940835 0.0412126 -0.0727885 0.1196268 -0.5835247 -0.6723128 -0.0289878 0.0060771 -0.0219824 -0.5213561 -0.0481915 -0.0303706 -0.1439873 -0.6031173 -0.8075395 -0.1338011 -0.0579643 -0.0806779 -0.5393548 -0.0035193 -0.0007733 0.0425785 -0.5060736 -0.8921616 0.0874104 0.0215537 0.0591011 -0.5412715 -0.0347014 0.0065262 -0.0696304 -0.5817195 0.0165683 0.0670105 -0.0098302 0.0946012 -0.1924842 -0.0735875 -0.1983233 -0.0013791 -0.1810775 -0.1733241 0.0059185 0.0729963 -0.1356502 -0.1300235 -0.0061311 0.2145645 -0.0366396 -0.0885268 -0.0179534 0.126052 0.2164432 0.2097305 -0.3731635 0.0298285 0.4692467 -0.0061898 -0.3482825 -0.1945293 -0.0431482 -0.0426327 -0.0489564 -0.1731974 0.0333995 -0.0632989 0.0156524 -0.1038533 -0.1582158 0.0455717 0.0662322 -0.1833338 -0.0545733 -0.0320274 -0.2945696 0.0059334 -0.0781427 -0.3238561 -0.0567326 -0.0871805 0.0000418 -0.0848641 0.059149 -0.0235157 0.0515243 -0.0560735 -0.1258307 0.0349774 0.0889168 0.1129443 -0.1118396 0.2571476 0.180298 0.2618212 0.0861085 0.0657242 -0.0386753 0.0270793 0.0262714 0.0350103 -0.001573 0.1400958 -0.0167884 0.1469169 -0.0320169 -0.0501047 -0.0695027 -0.0750969 0.0885574 0.0222075 -0.0123033 0.018879 0.0338756 -0.0322001 -0.0540736 0.0124923 -0.0341891 0.1003135 -0.0043247 -0.0649663 0.0006397 0.0390146 0.1386263 -0.0065716 -0.0474339 0.0783572 0.0271329 -0.01726 -0.1136359 -0.0215189 0.0446383 0.0934567 0.0125719 -0.0311441 -0.0003576 0.0665743 -0.0198928 -0.0388533 -0.0235823 0.0031532 0.1831308 -0.0264815 0.0457589 -0.0316118 0.0552765 0.0174293 0.0964017 0.0048206 0.1402026 0.0229206 0.0504542 0.0458756 0.0582185 0.0358491 0.0136597 0.0503023 0.0117166 0.0489668 0.294344 -0.0152156 -0.0384505 0.0024243 0.1536117 -0.0222218 -0.0814761 -0.0085947 0.1643994 0.0952657 0.0066013 -0.0030483 0.0283216 0.1111184 -0.112285 0.0319843 -0.1159574 0.0340086 0.0310796 0.0255636 0.0069204 0.0468918 0.1670856 -0.0678093 0.0441639 -0.078591 0.1169257 unknown
polarizability: 204.3284249|-6.2844488|115.3945299|0.3120833|20.2518752|138.987619 unknown
InChI: InChI=1S/C7H10O4S3/c1-13(8,9)5-6-14(10,11)7-3-2-4-12-7/h2-4H,5-6H2,1H3
charge 0 multiplicity 1
24 atoms
S  -0.432688 -1.062162 -0.987873
S  2.820868 0.387269 0.34051
S  -3.440785 -0.292673 -0.476738
O  0.466268 -2.003312 0.013005
O  -1.20328 -1.737522 -2.2610
O  4.252163 1.148569 0.142574
O  1.54346 1.187748 0.999619
C  0.811838 0.30166 -1.680223
C  2.226217 -0.17483 -1.46124
C  -1.707183 -0.130993 -0.026853
C  3.104215 -1.202608 1.354602
C  -1.487234 0.639479 1.101124
C  -2.72319 1.152102 1.637288
C  -3.84462 0.751796 0.923565
H  0.570191 1.217917 -1.114005
H  0.523037 0.368857 -2.741136
H  2.957807 0.336981 -2.108062
H  2.347972 -1.269428 -1.485164
H  3.318868 -0.846628 2.371812
H  2.168365 -1.774693 1.272904
H  3.969425 -1.707509 0.902321
H  -0.488246 0.843281 1.500251
H  -2.771355 1.794533 2.519233
H  -4.891111 0.992366 1.105887
