program: Gaussian 09
title: 000284526
version: EM64L-G09RevD.01
frameworkgroup: C1[X(C18H24O6)]
method: RPBEPBE
basis: SDD
operation: Freq
keyword: #pfreq=noraman
keyword: PBEPBE/SDD
title: #p freq=noraman PBEPBE/SDD
converged: NO YES NO NO
title: Mulliken charges:
elementType: O O O O O O C C C C C C C C C C C C C C C C C C H H H H H H H H H H H H H H H H H H H H H H H H
charge: -0.280086 -0.278119 -0.199538 -0.199392 -0.199617 -0.205812 0.385704 0.385737 0.334394 0.333608 -0.434616 -0.464553 -0.215491 -0.212766 -0.478384 -0.478392 0.193402 0.209431 -0.481381 -0.481442 -0.704819 -0.705260 -0.700024 -0.700584 0.269799 0.279313 0.257092 0.255434 0.204121 0.235572 0.237721 0.203329 0.192805 0.234739 0.192186 0.237318 0.232361 0.242630 0.222463 0.239051 0.233665 0.223508 0.232094 0.243271 0.217684 0.232899 0.239911 0.219038
chargesum: 0.00000
title: Mulliken charges with hydrogens summed into heavy atoms:
elementType: O O O O O O C C C C C C C C C C C C C C C C C C
charge: -0.280086 -0.278119 -0.199538 -0.199392 -0.199617 -0.205812 0.385704 0.385737 0.334394 0.333608 -0.164817 -0.185239 0.041600 0.042668 -0.038691 -0.037342 0.193402 0.209431 -0.053837 -0.051938 -0.007365 -0.009037 -0.006975 -0.008737
polarizability: 1.98561434e+02 4.48066414e+00 2.04774783e+02 -4.56487044e+00 3.76341513e+00 1.90850222e+02
1716.lowfreq: -10.5807 -7.6508 -0.0007 -0.0004 0.0004 7.4278 58.6471 70.6691 74.1243
frequency: 58.6378 70.6647 74.1074 74.2565 79.0616 92.3959 108.7824 118.3667 135.7125 142.9020 163.5416 178.2416 181.2678 186.9229 210.5599 218.2176 226.1599 240.8653 269.0228 270.2196 278.0809 296.5263 297.4902 315.4048 324.1296 345.4679 354.9775 370.2013 396.9187 433.1787 466.2684 489.7816 505.5280 522.4409 541.9736 596.4391 612.0249 666.8034 684.7800 718.5857 723.9164 727.6630 747.5422 762.8574 767.4360 776.1173 778.0187 783.0613 798.0506 834.4489 854.1523 883.0633 886.3170 907.3587 922.1924 928.2783 947.6726 951.4111 983.0394 989.7216 1007.2913 1013.6907 1033.0934 1041.1147 1059.2249 1064.4148 1070.2942 1091.7909 1093.5583 1106.5160 1111.6333 1113.5866 1126.2731 1140.0585 1149.6222 1166.6462 1172.1818 1193.4249 1195.6572 1200.0541 1210.1245 1247.4987 1264.3002 1277.2327 1280.5247 1285.3159 1289.9272 1291.5619 1317.1444 1330.3951 1332.9642 1335.4752 1338.9723 1340.5532 1351.9174 1376.2755 1390.3893 1393.8360 1395.8742 1397.8622 1455.4774 1457.1617 1457.7903 1458.4341 1472.9423 1474.2550 1476.8411 1479.4478 1484.1220 1487.5395 1488.9464 1490.8982 1653.3170 1657.7804 2981.3456 2982.0285 2987.3745 2987.8098 2989.5566 2989.6580 2989.7839 2989.9519 3037.8857 3039.0900 3041.5936 3042.4846 3052.9840 3055.4877 3058.3311 3060.8127 3079.7851 3080.2152 3080.4817 3080.8299 3100.6583 3101.6796 3102.8220 3103.4678
redmass: 4.1270 7.9481 2.8682 3.2688 2.7435 2.9880 3.1461 2.8178 2.9697 3.6671 1.5587 1.2626 1.6922 1.9903 1.4489 2.7986 2.9100 3.6714 2.8179 2.3835 2.6419 3.1544 3.3766 3.7388 6.5374 3.7594 6.8460 3.4328 6.9524 3.0820 9.2711 5.3738 5.2658 4.6626 4.1501 6.8057 3.3662 5.7027 3.9889 3.5764 5.8393 4.4153 4.3584 3.0212 3.3866 1.6610 1.6171 1.5363 1.5339 3.5432 3.3471 3.1915 3.1130 2.9822 2.1193 2.8509 2.9141 2.2328 3.1019 2.4362 2.9183 2.5404 2.9764 2.8946 2.4793 2.6007 2.1302 2.6519 2.3873 2.7989 2.8504 3.6598 3.2693 2.4578 6.2182 3.0181 2.3434 1.2519 1.2712 2.5317 2.6918 2.2129 1.3035 1.2566 1.2855 1.4722 1.4917 1.3612 1.5144 1.5154 1.5005 1.5749 1.6170 1.2219 1.8697 1.3153 1.2054 1.2048 1.2034 1.2158 1.0781 1.0778 1.0771 1.0779 1.0417 1.0413 1.0417 1.0407 1.0573 1.0558 1.0575 1.0561 11.1902 11.0165 1.0606 1.0601 1.0528 1.0484 1.0480 1.0399 1.0409 1.0406 1.0991 1.0989 1.1000 1.1003 1.0845 1.0841 1.0859 1.0866 1.0994 1.0994 1.0995 1.0995 1.0999 1.0997 1.1000 1.0998
irintensity: 0.0220 6.0664 1.0336 0.0915 0.5994 0.2258 1.1541 1.0108 0.7904 0.4172 0.8225 0.2850 1.5216 4.3948 1.5777 2.1537 2.4788 4.0089 0.7075 0.5364 0.4490 3.1848 4.7549 0.8337 2.2438 0.2985 0.0884 0.1165 0.3743 0.0459 0.5193 0.3018 0.2197 0.4145 0.2806 9.8492 5.2801 13.6364 2.9566 3.1762 5.8487 6.4213 0.5696 0.5244 2.3150 0.3156 24.0603 11.1997 17.1152 1.6813 56.1082 28.9557 12.6377 1.9698 6.3219 0.9414 2.1343 18.5899 43.4334 0.9297 14.0409 1.4851 12.7434 104.3681 48.9401 19.9480 5.3295 25.2839 21.6016 6.2353 27.2529 1.0895 28.4967 19.9856 14.6243 12.3328 4.8178 7.7503 2.2423 59.3326 142.4798 127.7023 10.9763 8.6933 11.3357 0.4962 37.9929 10.9709 24.6122 0.4721 6.7597 1.2007 0.7087 9.8934 46.6307 31.7600 4.5639 27.8737 32.6950 14.9658 0.5061 10.3326 8.8254 4.7004 8.1229 12.3968 10.3351 12.2385 18.0786 16.2160 13.3822 13.2344 466.5766 124.5116 28.4080 22.9275 17.2318 39.4491 9.5200 28.8558 26.8932 3.1861 6.7730 7.4197 8.0170 5.5911 0.4575 0.0956 29.7888 12.0844 45.4810 10.5190 58.9377 42.0425 27.0743 19.8926 37.0512 20.4351
temp: 298.150 k
press: 1.00000 atm
elementType: 8 8 8 8 8 8 6 6 6 6 6 6 6 6 6 6 6 6 6 6 6 6 6 6 1 1 1 1 1 1 1 1 1 1 1 1 1 1 1 1 1 1 1 1 1 1 1 1
symmnumber: 1
zpe: 1028062.1 jmol-1
zpe.correction: 0.391568 hartree
zpe.thermalcorrener: 0.414918 hartree
zpe.thermalcorrenthalpy: 0.415862 hartree
zpe.thermalcorrgfe: 0.341274 hartree
zpe.sumelectzpe: -1149.765204 hartree
zpe.sumelectthermal: -1149.741855 hartree
zpe.sumelectthermalent: -1149.740910 hartree
zpe.sumelectthermalfe: -1149.815499 hartree
dipole: -0.1601 -1.2017 -0.6773
dipole: 1.3887
quadrupole: -142.9859 -129.6878 -171.3596
quadrupole: -2.5233 15.8209 14.6681
quadrupole: 5.0252 18.3233 -23.3485 -2.5233 15.8209 14.6681
hfenergy: -1150.1567723 hartree
pointgroup: C01 [X(C18H24O6)]
dipole: -0.0946894 -0.4452509 -0.3021646 debye
polarizability: 200.2519212|4.903082|203.0773986|-3.0656615|5.4193509|190.8571184 unknown
InChI: InChI=1S/C18H24O6/c1-5-15-9-11(19)21-13-17(7-3,23-15)14-18(13,8-4)24-16(9,6-2)10(15)12(20)22-14/h9-10,13-14H,5-8H2,1-4H3
charge 0 multiplicity 1
48 atoms
O  -1.625487 0.620584 -0.57102
O  1.462498 -0.891302 0.728467
O  -1.376981 -1.428127 1.704021
O  0.862269 -0.122968 -2.200884
O  -1.486737 -0.062434 3.509054
O  1.920449 1.876344 -2.340444
C  -0.708532 1.43626 0.224819
C  1.178332 0.514859 1.013959
C  -1.348178 -0.78096 -0.876365
C  0.566774 -1.712707 -0.082565
C  -0.252608 0.830563 1.616751
C  0.812381 1.437536 -0.222038
C  -0.958839 -1.717964 0.337833
C  0.083104 -1.112408 -1.464927
C  -1.383543 2.813624 0.291621
C  2.36951 0.982158 1.86272
C  -1.067047 -0.219175 2.347876
C  1.24012 1.105786 -1.638088
C  -2.542878 -1.239348 -1.723484
C  1.248027 -3.086417 -0.14663
C  -1.526273 3.490657 -1.087661
C  3.714533 0.935385 1.108463
C  -3.88733 -1.172838 -0.969374
C  2.616649 -3.058638 -0.858306
H  -0.152771 1.658747 2.339043
H  1.22497 2.442923 -0.031574
H  -1.379572 -2.723456 0.168487
H  -0.00915 -1.932243 -2.197612
H  -0.793048 3.459209 0.970411
H  -2.379561 2.681997 0.75638
H  2.415461 0.342609 2.764956
H  2.166477 2.01451 2.207949
H  -2.35142 -2.276854 -2.063106
H  -2.581995 -0.60648 -2.63087
H  0.566954 -3.789137 -0.667111
H  1.363248 -3.458709 0.88933
H  -0.541798 3.660951 -1.561841
H  -2.128933 2.8655 -1.76709
H  -2.023468 4.471471 -0.985686
H  3.946789 -0.094134 0.788782
H  3.70019 1.578579 0.208975
H  4.533606 1.2877 1.760073
H  -3.870965 -1.795652 -0.055926
H  -4.111514 -0.136682 -0.666981
H  -4.709768 -1.53353 -1.61231
H  2.528323 -2.678483 -1.892753
H  3.322794 -2.406456 -0.318246
H  3.049136 -4.073847 -0.90458
