program: Gaussian 09
title: 000284503
version: EM64L-G09RevD.01
frameworkgroup: C1[X(C14H18O5S)]
method: RPBEPBE
basis: SDD
operation: Freq
keyword: #p
keyword: freq=noraman
keyword: PBEPBE/SDD
title: #p freq=noraman PBEPBE/SDD
converged: YES YES NO NO
title: Mulliken charges:
elementType: S O O O O O C C C C C C C C C C C C C C H H H H H H H H H H H H H H H H H H
charge: 0.948946 -0.280198 -0.564721 -0.566095 -0.218928 -0.235585 0.142892 -0.664335 -0.685598 -0.694521 0.265662 -0.779614 -0.360529 0.112331 0.297526 -0.333375 -0.343709 -0.240840 -0.224361 -0.219287 0.294182 0.291119 0.234583 0.211443 0.270368 0.243388 0.227776 0.227684 0.258048 0.338904 0.282131 0.247179 0.280390 0.247124 0.276339 0.237197 0.238009 0.238474
chargesum: 0.00000
title: Mulliken charges with hydrogens summed into heavy atoms:
elementType: S O O O O O C C C C C C C C C C C C C C
charge: 0.948946 -0.280198 -0.564721 -0.566095 -0.218928 -0.235585 0.142892 -0.079034 0.030796 0.004327 0.265662 0.099469 0.167041 0.112331 0.297526 -0.086252 -0.067370 -0.003644 0.013648 0.019188
polarizability: 2.56141619e+02 2.74543409e+00 1.85993644e+02 -1.20778799e+01 2.08100293e+01 1.37600197e+02
1716.lowfreq: -5.2013 -2.3028 0.0015 0.0016 0.0017 10.7660 22.2227 30.0472 49.0178
frequency: 22.1517 29.8839 49.0056 57.1820 70.6016 79.2767 94.2244 113.8497 135.2730 156.2143 172.5605 183.8115 200.8698 210.6171 221.4154 230.0393 234.2580 247.0810 261.5251 281.8122 295.7033 319.0592 326.5432 352.9609 374.4534 397.9200 407.1461 414.2453 455.7121 519.5130 559.4222 573.4334 582.1974 602.6365 612.9672 643.6120 693.7702 696.0047 738.5365 769.5349 783.4348 822.1321 858.1727 859.0538 880.6323 903.1536 935.4712 939.8969 947.5748 966.1546 981.1481 984.2202 989.6819 992.9978 1012.3350 1012.8089 1023.0977 1024.7691 1040.9594 1088.0086 1091.6761 1105.7000 1145.9989 1175.8682 1192.9031 1215.0508 1233.6928 1241.4132 1255.2123 1282.3036 1319.3845 1321.9131 1348.4130 1376.1111 1389.7029 1393.9902 1409.3910 1422.5137 1438.2340 1442.0763 1445.6836 1455.9636 1470.5140 1474.6049 1482.5094 1496.4393 1574.1579 1600.1673 1615.1513 1653.6160 2984.6894 2986.5645 3000.0412 3000.6346 3046.2771 3049.1030 3087.7152 3092.9918 3101.8001 3113.0734 3133.0897 3141.6073 3145.7244 3149.6366 3151.8339 3161.6732 3170.9564 3172.3840
redmass: 6.9914 4.0035 5.6154 5.5343 6.9907 3.8118 5.7791 3.6533 5.7133 4.9510 2.9021 2.7491 2.1732 1.8119 3.8761 3.1628 1.5580 1.1954 2.2161 4.1286 3.8594 5.3435 6.4794 3.1925 3.1355 2.8224 5.0583 3.4762 4.6167 4.4030 4.3811 2.8307 7.1634 4.3732 6.4414 6.6600 2.0239 5.1082 6.7484 1.6910 11.4253 3.0675 1.2580 3.4013 4.5444 2.0385 1.4492 2.3103 2.0551 1.9990 2.1070 1.3197 5.7122 1.4246 1.3774 1.3633 1.9014 1.7608 2.5447 2.1910 2.0530 1.7874 2.0264 1.0656 1.1222 1.0869 2.7816 3.0027 1.4051 2.1782 1.3496 1.1454 1.6512 1.1688 9.2380 1.1354 1.1494 1.0497 2.2543 1.0963 1.0662 1.0480 1.0510 1.0538 2.1482 1.0615 6.7863 6.9081 6.9047 10.9637 1.0339 1.0573 1.0359 1.0267 1.1020 1.0549 1.1010 1.1010 1.1001 1.1003 1.0853 1.0880 1.1111 1.1077 1.0924 1.0963 1.1064 1.1015
irintensity: 2.6473 0.9321 2.9409 4.1376 3.6307 3.3011 5.6780 8.0718 6.5445 0.3914 1.1971 7.0113 2.1040 1.8748 2.1948 4.8892 0.7578 5.4059 0.9356 17.0792 10.5229 5.2194 17.9673 12.0628 2.5731 0.0705 10.5455 1.6181 4.5017 6.3020 12.8441 8.3769 21.5713 14.0136 0.2767 18.1781 30.8912 42.3850 2.5903 54.3700 39.9339 21.4355 0.3622 20.4188 51.8391 12.5315 2.2632 22.5765 32.4528 37.2449 1.5071 21.2270 5.4870 0.6786 22.6724 1.8024 16.6105 23.4203 25.7783 207.9038 164.5833 109.5241 2.5378 2.0452 11.6434 2.7530 146.4454 16.3193 6.1696 7.0312 0.5182 6.5243 61.5379 12.9157 3.3081 28.3588 25.9018 6.2396 26.5432 24.3566 6.3270 9.3514 6.7423 12.7709 1.0020 16.9610 122.8850 97.8861 23.7885 138.1300 23.3709 47.3992 24.0920 63.1465 6.5646 5.0452 20.7578 13.2155 17.7636 9.7314 0.3806 4.2383 5.8704 41.9629 15.7555 17.1812 1.8108 19.0541
temp: 298.150 k
press: 1.00000 atm
elementType: 16 8 8 8 8 8 6 6 6 6 6 6 6 6 6 6 6 6 6 6 1 1 1 1 1 1 1 1 1 1 1 1 1 1 1 1 1 1
symmnumber: 1
zpe: 772745.0 jmol-1
zpe.correction: 0.294323 hartree
zpe.thermalcorrener: 0.316062 hartree
zpe.thermalcorrenthalpy: 0.317006 hartree
zpe.thermalcorrgfe: 0.242716 hartree
zpe.sumelectzpe: -1316.797405 hartree
zpe.sumelectthermal: -1316.775666 hartree
zpe.sumelectthermalent: -1316.774722 hartree
zpe.sumelectthermalfe: -1316.849011 hartree
dipole: 5.5267 -1.5111 4.4425
dipole: 7.2501
quadrupole: -109.9558 -125.6851 -132.4230
quadrupole: 8.4708 -18.6091 3.3097
quadrupole: 12.7322 -2.9971 -9.7350 8.4708 -18.6091 3.3097
hfenergy: -1317.0917278 hartree
pointgroup: C01 [X(C14H18O5S1)]
dipole: 2.3091983 0.5719472 -1.5737809 debye
polarizability: 253.2559282|-12.2335038|182.2881|18.840193|23.8852478|144.1914323 unknown
InChI: InChI=1S/C14H18O5S/c1-14(2,10-20(3,17)18)13(16)19-9-12(15)11-7-5-4-6-8-11/h4-8H,9-10H2,1-3H3
charge 0 multiplicity 1
38 atoms
S  -3.142931 -1.428475 0.148296
O  -0.783235 0.746922 -0.430854
O  -2.33171 -0.892379 1.476628
O  -4.647037 -2.053336 0.319813
O  -1.457251 2.325798 1.14565
O  0.82422 -1.288807 -1.136417
C  -3.123803 1.400078 -0.449551
C  -3.277269 0.039444 -1.143602
C  -4.233946 1.657375 0.599766
C  -3.185703 2.497328 -1.565884
C  -1.745455 1.540332 0.221879
C  -2.04549 -2.725926 -0.721802
C  0.540931 0.739224 0.194383
C  1.357526 -0.415153 -0.39426
C  2.810185 -0.476249 -0.033266
C  3.411554 0.439748 0.874268
C  3.605597 -1.500131 -0.617299
C  4.782168 0.330491 1.188391
C  4.974731 -1.60396 -0.306177
C  5.56647 -0.688123 0.597902
H  -4.283671 -0.113035 -1.564821
H  -2.474753 -0.159234 -1.869504
H  -4.113231 2.663749 1.033269
H  -5.227445 1.588989 0.122048
H  -4.180117 0.925956 1.422921
H  -3.048947 3.493949 -1.110856
H  -4.173493 2.476296 -2.06013
H  -2.403591 2.347839 -2.331559
H  -2.606506 -3.065396 -1.604379
H  -1.09245 -2.230602 -0.96612
H  -1.929129 -3.5289 0.019844
H  1.040489 1.710666 0.021349
H  0.425106 0.608387 1.288835
H  2.820624 1.231564 1.346937
H  3.123603 -2.197987 -1.309882
H  5.238927 1.034592 1.891827
H  5.58187 -2.393197 -0.762078
H  6.631463 -0.769037 0.842039
