program: Gaussian 09
title: 000022680
version: EM64L-G09RevD.01
frameworkgroup: C1[X(C7H5NO5)]
method: RPBEPBE
basis: SDD
operation: Freq
keyword: #pfreq=noraman
keyword: PBEPBE/SDD
title: #p freq=noraman PBEPBE/SDD
converged: NO NO NO NO
title: Mulliken charges:
elementType: O O O O O N C C C C C C C H H H H H
charge: -0.218137 -0.206247 -0.185860 -0.418350 -0.246095 0.051654 0.404691 -0.339739 0.278772 -0.298188 -0.262410 -0.262532 0.167756 0.277638 0.298308 0.283583 0.290628 0.384528
chargesum: 0.00000
title: Mulliken charges with hydrogens summed into heavy atoms:
elementType: O O O O O N C C C C C C C
charge: -0.218137 -0.206247 -0.185860 -0.033822 -0.246095 0.051654 0.404691 -0.062101 0.278772 0.000121 0.021173 0.028097 0.167756
polarizability: 2.26979250e+02 7.32627770e+00 1.17594615e+02 1.32305174e-02 1.40838991e-02 3.94353434e+01
1716.lowfreq: -13.7246 -6.2768 -6.0933 0.0001 0.0003 0.0005 46.6360 55.4386 61.8253
frequency: 46.6015 55.4202 61.8148 96.3564 168.5481 173.8738 182.5613 227.4945 343.0409 344.6348 412.5718 477.2093 533.4995 563.9028 579.0646 579.7373 644.3029 682.2101 703.9542 726.1664 763.4117 817.4672 894.6766 908.2585 909.8488 922.0867 934.2978 992.6591 1027.5672 1053.3700 1134.8664 1181.7027 1218.6377 1228.5786 1276.0970 1288.4793 1325.6854 1355.2062 1373.3715 1486.3424 1543.6908 1624.0463 1655.2763 3134.7109 3179.8465 3231.4167 3260.9647 3527.2238
redmass: 10.8689 12.4587 8.9065 5.9282 8.7822 7.4386 2.9282 10.8543 6.7372 3.3739 9.3101 7.1873 4.4305 5.0664 1.5433 5.1744 2.4359 8.4074 4.8991 9.9447 6.7732 1.3308 1.8713 1.4653 8.3779 5.8406 5.2462 1.1086 1.2423 2.1760 3.8940 1.8902 4.2673 1.4269 1.6699 5.0268 2.3841 8.3458 3.8975 8.6995 6.0199 8.8231 6.4673 1.0916 1.0929 1.0967 1.1031 1.0642
irintensity: 1.7142 3.1011 2.5473 2.4276 0.4118 0.0543 0.0030 2.5534 4.4919 0.6166 5.5475 6.3373 22.5083 9.3845 81.0888 40.2002 61.9924 18.4721 16.1908 21.5390 6.8082 69.8618 0.0963 5.0469 11.3817 3.4319 0.8456 61.7386 45.3674 496.7066 39.6953 25.1622 346.4872 27.5478 11.2024 70.6190 33.4502 169.4042 2.1146 128.3037 36.3628 337.4909 46.7824 0.0846 3.4375 0.2579 5.8314 69.8111
temp: 298.150 k
press: 1.00000 atm
elementType: 8 8 8 8 8 7 6 6 6 6 6 6 6 1 1 1 1 1
symmnumber: 1
zpe: 304167.0 jmol-1
zpe.correction: 0.115851 hartree
zpe.thermalcorrener: 0.127351 hartree
zpe.thermalcorrenthalpy: 0.128295 hartree
zpe.thermalcorrgfe: 0.076519 hartree
zpe.sumelectzpe: -699.557917 hartree
zpe.sumelectthermal: -699.546418 hartree
zpe.sumelectthermalent: -699.545473 hartree
zpe.sumelectthermalfe: -699.597250 hartree
dipole: -2.2352 3.6106 -0.0064
dipole: 4.2465
quadrupole: -86.2353 -71.8386 -73.7054
quadrupole: 18.0084 -0.0233 -0.0027
quadrupole: -8.9755 5.4211 3.5544 18.0084 -0.0233 -0.0027
hfenergy: -699.6737684 hartree
pointgroup: C01 [X(C7H5N1O5)]
dipole: -0.8981286 -1.4087434 0.003075 debye
dipolederiv: -0.1021678 0.0801937 -0.0000858 0.084509 -0.5223017 -0.0000168 -0.000239 -0.0004013 -0.0829951 -1.1289999 0.0007781 -0.0005459 0.0509563 -0.4371342 0.0005068 0.0023233 -0.0002479 -0.2346566 -0.4161776 0.0298307 0.0004948 -0.2984861 -0.8059907 -0.0007087 0.0006352 0.0016076 -0.2121052 -0.7391505 0.5119065 0.0002729 0.7017795 -1.1169495 0.0000953 -0.0012128 0.0024506 -0.4288266 -1.1450307 -0.1699277 0.0002378 -0.2667693 -0.7581707 0.0009586 -0.002228 -0.0016178 -0.3306338 1.8966594 0.2724611 -0.0005242 0.8551077 1.3560546 -0.0004212 -0.0021789 -0.0007477 0.2076094 0.0854738 0.0171728 0.0001015 -0.2618889 0.1799645 0.000263 -0.0007489 0.0001034 0.0894526 -0.3128785 -0.0741273 0.0001352 0.1914613 0.0723087 -0.0000339 -0.0005389 0.0000587 -0.1782972 -0.6845181 -0.2445021 0.0003663 -0.8675139 -0.2390785 0.0005929 0.0003807 -0.0001192 0.1029897 0.24237 0.0595712 0.0000041 0.18431 0.1593187 -0.0001432 -0.0005765 -0.0002667 -0.1156236 0.4613134 -0.1268463 -0.0001247 -0.0944375 0.1693565 0.0000971 0.001536 -0.0001764 -0.0892288 -0.9960131 0.2560442 -0.0002836 0.3915857 -0.1152601 0.0001554 0.0000079 0.0002157 -0.1317569 2.3506272 -0.4114609 0.000518 -0.3171526 1.4595148 -0.0009822 0.0021262 -0.0003892 0.2465042 0.0977781 -0.0595201 0.0000283 -0.053914 0.0480496 -0.0000188 0.000175 0.0000301 0.1959265 0.072907 0.0258378 0.0000135 0.0019853 0.1425325 0. 0.0000991 0.0000077 0.2021392 0.0830998 -0.0318384 0.0000146 -0.0337352 0.030485 -0.0000712 0.0002298 -0.0000943 0.1707899 0.0311566 -0.0386631 -0.0000375 -0.0920886 0.0567542 -0.0001667 0.0007361 -0.0002499 0.1832533 0.2035509 -0.0969101 -0.0005854 -0.1757086 0.3205462 -0.0001065 -0.0005263 -0.0001636 0.4054589 unknown
polarizability: 226.7661297|-8.7716076|117.8077332|0.0021762|-0.0197961|39.4353451 unknown
InChI: InChI=1S/C7H5NO5/c9-7(10)4-2-5-1-3-6(13-5)8(11)12/h1-4,9H
charge 0 multiplicity 1
18 atoms
O  0.732663 0.269916 -0.002165
O  4.309856 0.391333 -0.005218
O  2.750674 2.083787 -0.004872
O  -4.157339 1.697347 -0.004621
O  -4.396666 -0.622158 -0.005562
N  3.091254 0.839494 -0.001616
C  -0.053181 -0.908926 -0.002464
C  0.796073 -2.026829 -0.002385
C  2.05868 -0.160628 -0.00193
C  2.144816 -1.550046 -0.002168
C  -1.485576 -0.783062 -0.002542
C  -2.175364 0.40085 -0.00184
C  -3.651642 0.38991 -0.001194
H  0.470542 -3.06511 -0.00241
H  3.06549 -2.126989 -0.002141
H  -2.056266 -1.720364 -0.003048
H  -1.670797 1.370981 -0.001064
H  -5.152016 1.665693 -0.007661
