program: Gaussian 09
title: 000284490
version: EM64L-G09RevD.01
frameworkgroup: C1[X(C12H12O2S2)]
method: RPBEPBE
basis: SDD
operation: Freq
keyword: #p
keyword: freq=noraman
keyword: PBEPBE/SDD
title: #p freq=noraman PBEPBE/SDD
converged: YES YES NO NO
title: Mulliken charges:
elementType: S S O O C C C C C C C C C C C C H H H H H H H H H H H H
charge: 0.860306 0.210685 -0.541990 -0.535426 0.062646 -0.156856 -0.035240 -0.230210 -0.050115 -0.766669 -0.247279 -0.248810 -0.749192 -0.207207 -0.214486 -0.217527 0.299030 0.284159 0.242793 0.240426 0.280767 0.273280 0.243966 0.240568 0.244090 0.240633 0.240684 0.236976
chargesum: 0.00000
title: Mulliken charges with hydrogens summed into heavy atoms:
elementType: S S O O C C C C C C C C C C C C
charge: 0.860306 0.210685 -0.541990 -0.535426 0.062646 -0.156856 -0.035240 0.068820 -0.050115 0.000708 0.033487 0.024470 -0.020568 0.033426 0.026198 0.019449
polarizability: 2.06461918e+02 -6.89191474e+00 1.78751478e+02 6.88604940e+00 -1.03495118e+01 1.30870840e+02
1716.lowfreq: -6.8887 -0.0020 -0.0012 0.0007 3.9826 5.3447 20.9888 36.9681 42.1925
frequency: 20.8811 36.9577 42.1787 103.4331 125.3723 134.1784 145.9620 157.2771 161.5831 201.0478 228.6014 234.9724 246.6421 267.6451 304.4736 339.4447 391.7134 398.8657 403.9590 452.9044 480.0906 485.4856 511.6285 603.0294 611.8999 619.9173 655.0622 660.2916 692.8927 751.0640 763.5798 791.2923 851.9426 872.0181 918.1804 933.5339 974.7564 979.5672 981.7364 997.4659 1004.2998 1009.0609 1041.1428 1045.0119 1049.3742 1076.8621 1131.3917 1145.6966 1173.0735 1176.4733 1178.4411 1301.6462 1306.1435 1383.5971 1400.4102 1401.8790 1435.5213 1453.1527 1458.8572 1460.2651 1468.6014 1480.2700 1556.7156 1574.7260 1578.2134 1605.4414 2976.4108 2980.0357 3058.6967 3062.6696 3090.2379 3090.6432 3135.7789 3145.9596 3154.7360 3163.5124 3173.4989 3189.4661
redmass: 3.6890 4.5100 5.4517 1.0735 1.8521 4.6995 4.0434 1.7823 5.4413 4.5701 6.1428 6.2507 8.0391 3.6624 4.4001 5.2937 8.9188 6.0189 2.8249 7.8426 5.1733 4.3384 4.9647 6.4703 4.8740 5.1979 5.8610 6.0934 2.2580 6.8021 1.5452 9.4859 1.2463 1.3139 13.9868 1.3820 2.0483 5.7127 1.3908 1.6078 1.3447 4.0894 1.3954 1.4084 2.1376 1.5462 1.8597 4.2138 1.0588 1.2720 1.8979 1.3053 3.0661 8.1805 1.2023 1.2257 2.2485 2.0287 1.0430 1.0860 1.0870 1.0513 7.0784 6.1911 5.8289 6.9632 1.0374 1.0367 1.0983 1.0966 1.0997 1.0988 1.0856 1.0882 1.0924 1.0967 1.1015 1.0952
irintensity: 0.2129 0.4604 0.5430 0.1675 2.7230 2.9150 2.9711 1.9720 0.2700 1.5801 8.7240 0.4032 4.0120 1.1725 0.3239 0.1201 19.0315 7.0353 0.0268 90.8401 1.6927 3.9897 125.9324 0.0347 9.5939 6.1217 2.6613 12.1973 38.4676 11.5805 81.4172 47.4689 0.3490 21.2414 79.0347 1.7127 1.1376 1.6361 0.0823 6.1409 0.2771 1.8153 1.0600 9.4824 23.0666 4.7352 47.6739 7.3365 0.0148 9.1273 6.9883 4.2168 10.7509 4.2037 21.6854 3.1624 15.3005 17.6337 16.8880 9.4891 13.1811 22.8876 24.9295 12.6494 4.7526 0.2847 22.5722 30.5147 15.6174 14.4629 3.3247 7.9403 0.8076 9.0152 1.7830 5.7367 29.1716 7.3732
temp: 298.150 k
press: 1.00000 atm
elementType: 16 16 8 8 6 6 6 6 6 6 6 6 6 6 6 6 1 1 1 1 1 1 1 1 1 1 1 1
symmnumber: 1
zpe: 542216.0 jmol-1
zpe.correction: 0.206519 hartree
zpe.thermalcorrener: 0.223031 hartree
zpe.thermalcorrenthalpy: 0.223975 hartree
zpe.thermalcorrgfe: 0.161050 hartree
zpe.sumelectzpe: -1409.707552 hartree
zpe.sumelectthermal: -1409.691041 hartree
zpe.sumelectthermalent: -1409.690096 hartree
zpe.sumelectthermalfe: -1409.753022 hartree
dipole: 0.2791 -1.4484 -6.0286
dipole: 6.2064
quadrupole: -91.3580 -99.9116 -123.2440
quadrupole: -2.2220 8.7982 -3.0463
quadrupole: 13.4799 4.9263 -18.4061 -2.2220 8.7982 -3.0463
hfenergy: -1409.9140714 hartree
pointgroup: C01 [X(C12H12O2S2)]
dipole: 0.092215 -1.0378511 2.2083173 debye
polarizability: 206.6454432|8.1263511|173.2643726|2.3128988|18.7178973|136.1744193 unknown
InChI: InChI=1S/C12H12O2S2/c1-9-8-12(10(2)15-9)16(13,14)11-6-4-3-5-7-11/h3-8H,1-2H3
charge 0 multiplicity 1
28 atoms
S  0.16207 0.582676 -1.364204
S  -3.288854 0.323161 1.429051
O  0.305073 2.200788 -1.57923
O  0.059384 -0.456438 -2.626069
C  -1.338532 0.227961 -0.28517
C  -1.809375 1.081012 0.695528
C  1.658173 0.03308 -0.324979
C  -2.077689 -0.985067 -0.519284
C  -3.171221 -1.11527 0.316769
C  -1.30718 2.404773 1.197455
C  2.072236 -1.303633 -0.431099
C  2.320898 1.001767 0.444172
C  -4.196637 -2.210574 0.388857
C  3.207061 -1.698569 0.315538
C  3.4547 0.588482 1.182488
C  3.889531 -0.756908 1.122299
H  -1.809752 -1.699114 -1.300751
H  -0.634449 2.852885 0.446379
H  -2.139539 3.108092 1.374578
H  -0.756206 2.29155 2.150762
H  1.542054 -1.996992 -1.092316
H  1.981042 2.04281 0.438128
H  -3.966547 -2.986076 -0.36168
H  -4.214716 -2.69574 1.382512
H  -5.21584 -1.833816 0.183377
H  3.560534 -2.733412 0.258956
H  3.999816 1.316256 1.792644
H  4.770265 -1.069087 1.694088
