program: Gaussian 09
title: 000284483
version: EM64L-G09RevD.01
frameworkgroup: C1[X(C13H17NO4S)]
method: RPBEPBE
basis: SDD
operation: Freq
keyword: #p
keyword: freq=noraman
keyword: PBEPBE/SDD
title: #p freq=noraman PBEPBE/SDD
converged: YES YES NO NO
title: Mulliken charges:
elementType: S O O O O N C C C C C C C C C C C C C H H H H H H H H H H H H H H H H H
charge: 0.931046 -0.242352 -0.552009 -0.573790 -0.301916 -0.114388 -0.371902 -0.354538 -0.752000 0.295116 -0.297240 -0.310602 -0.782540 0.536746 -0.349094 -0.358609 -0.215032 -0.215412 -0.225391 0.263381 0.233067 0.231356 0.232012 0.300226 0.304316 0.224822 0.206809 0.255449 0.221207 0.318199 0.279016 0.237999 0.247228 0.231613 0.233186 0.234021
chargesum: 0.00000
title: Mulliken charges with hydrogens summed into heavy atoms:
elementType: S O O O O N C C C C C C C C C C C C C
charge: 0.931046 -0.242352 -0.552009 -0.573790 -0.301916 -0.114388 0.124545 0.108830 -0.147458 0.295116 0.134392 0.166055 -0.185325 0.536746 -0.111096 -0.111381 0.016581 0.017774 0.008631
polarizability: 2.54427701e+02 9.85757024e+00 1.92588628e+02 -7.83884191e+00 2.47378812e+00 1.42304476e+02
1716.lowfreq: -20.9977 -8.2861 -7.2687 -6.0038 -0.0020 -0.0018 -0.0017 18.0213 35.6672
frequency: -8.0785 13.8652 35.6486 47.1387 55.2940 74.0891 77.0694 108.4588 145.1643 175.5003 178.2924 192.6522 227.3891 281.2464 306.1590 325.1290 331.5042 350.2293 370.7204 397.5612 401.4793 411.6583 440.0740 463.2146 491.5229 515.7214 562.1955 572.3236 591.4185 615.1123 691.0590 695.2995 732.9951 772.5588 794.3153 800.1510 814.6124 831.0878 850.7310 869.5477 884.7778 913.3923 932.2832 941.4141 947.0257 981.7914 989.4129 1002.1665 1003.3638 1018.2394 1025.9381 1046.9028 1068.3565 1075.5952 1078.7141 1120.9605 1122.7778 1173.1685 1176.4334 1187.1097 1191.4029 1194.6715 1208.2002 1238.1346 1240.3582 1261.8824 1274.0182 1325.0110 1330.8183 1339.3755 1348.0411 1364.4131 1389.6488 1404.1850 1433.4008 1443.6865 1444.1761 1446.1658 1448.4359 1450.2432 1461.0471 1484.5359 1557.4589 1588.6636 1610.7806 2964.1313 2987.4437 2996.1596 2999.5845 3046.2827 3071.5160 3087.9284 3094.8117 3095.8799 3112.6176 3129.6856 3133.6181 3142.1218 3143.7942 3155.9592 3164.2096 3170.1907
redmass: 5.0329 5.2096 3.8699 6.1630 4.8248 5.4150 6.1891 5.9033 9.1819 8.4525 5.7719 2.5873 9.1874 3.5017 2.8645 5.8018 4.0457 2.1886 4.5835 2.3328 2.7024 5.5311 2.8168 2.8708 7.5357 4.1572 4.4375 3.7580 2.5913 6.3028 3.3100 1.7121 5.7364 2.0348 7.1441 4.5201 4.1950 1.6667 1.2559 2.2706 2.2786 2.0220 1.4843 3.1458 3.1551 1.4061 5.8488 1.3396 2.4584 1.8184 2.1806 2.3622 3.1400 1.4829 1.5224 1.5287 1.3549 3.7149 1.0550 1.1806 1.1377 1.0737 1.1589 2.1189 1.8891 1.4339 1.2137 1.2308 1.2763 1.2122 1.3345 1.3209 8.8180 1.6969 1.5427 1.7883 1.2841 1.1237 1.0916 1.1281 1.0919 2.3517 6.7242 5.9114 5.9823 1.0671 1.0669 1.0634 1.0639 1.0579 1.0574 1.0970 1.0997 1.1018 1.0956 1.0852 1.0887 1.1121 1.0928 1.0969 1.1101 1.1018
irintensity: 0.2554 1.7416 0.3823 2.1758 2.3882 4.6405 8.8181 4.1697 2.2036 0.7033 18.2271 3.8995 2.3486 5.9162 12.0311 15.1231 27.3900 1.8610 3.5857 7.6590 1.4581 11.8602 1.9644 12.1718 62.0727 17.0629 29.3287 5.4587 4.0177 0.0329 5.3619 50.9542 3.7596 16.2009 55.7582 24.1340 5.4626 0.5818 0.2714 26.6903 2.5945 13.4796 6.0884 48.2349 5.7806 0.0932 0.9424 0.0713 11.6882 80.7791 2.7332 46.1573 23.1254 15.5727 9.7538 1.2902 4.5451 0.4945 0.0615 5.6399 6.2487 3.3304 14.0437 59.1836 26.2523 47.7432 34.7849 1.0642 0.7961 9.7809 5.0220 3.1845 1.1727 20.4450 57.3834 10.5001 3.6103 33.2116 6.2861 27.3151 7.3595 3.8894 263.0418 1.1026 7.2252 38.4860 21.2442 15.3078 80.7007 3.9073 1.1200 40.4565 2.2256 32.8701 17.4396 1.7239 0.0982 5.4978 13.7811 26.8564 0.3097 22.6141
temp: 298.150 k
press: 1.00000 atm
elementType: 16 8 8 8 8 7 6 6 6 6 6 6 6 6 6 6 6 6 6 1 1 1 1 1 1 1 1 1 1 1 1 1 1 1 1 1
symmnumber: 1
zpe: 743327.8 jmol-1
zpe.correction: 0.283119 hartree
zpe.thermalcorrener: 0.301257 hartree
zpe.thermalcorrenthalpy: 0.302201 hartree
zpe.thermalcorrgfe: 0.234723 hartree
zpe.sumelectzpe: -1257.691314 hartree
zpe.sumelectthermal: -1257.673175 hartree
zpe.sumelectthermalent: -1257.672231 hartree
zpe.sumelectthermalfe: -1257.739710 hartree
dipole: -0.3691 0.5356 1.9552
dipole: 2.0605
quadrupole: -103.4452 -118.0763 -132.2357
quadrupole: 11.1503 0.9141 -0.4791
quadrupole: 14.4738 -0.1572 -14.3166 11.1503 0.9141 -0.4791
hfenergy: -1257.9744324 hartree
pointgroup: C01 [X(C13H17N1O4S1)]
dipole: -0.0759863 -0.6667439 -0.4548336 debye
polarizability: 254.5836436|6.6369247|175.0356958|12.7464016|-22.7590922|159.7014653 unknown
InChI: InChI=1S/C13H17NO4S/c15-13(14-6-8-18-9-7-14)11-19(16,17)10-12-4-2-1-3-5-12/h1-5H,6-11H2
charge 0 multiplicity 1
36 atoms
S  0.12209 1.908376 -0.695123
O  -3.830053 -0.893513 2.004981
O  0.605524 3.452096 -0.93445
O  -0.238221 1.385293 0.814143
O  -1.552939 -0.708136 -2.25754
N  -3.019267 0.03852 -0.599158
C  -3.573163 -1.326467 -0.421484
C  -3.484475 1.003318 0.427028
C  -1.521489 1.648867 -1.772901
C  -2.042271 0.245468 -1.554065
C  -3.285202 -1.828473 1.00784
C  -3.209725 0.43153 1.838491
C  1.466998 0.647523 -1.57876
C  2.547662 0.331953 -0.618483
C  2.447043 -0.804722 0.229928
C  3.688902 1.17578 -0.517943
C  3.476657 -1.10155 1.146428
C  4.71505 0.878685 0.401275
C  4.612174 -0.261561 1.233736
H  -3.114499 -1.982667 -1.178904
H  -4.667985 -1.28354 -0.581281
H  -4.571692 1.168321 0.293498
H  -2.955342 1.963083 0.336442
H  -2.148843 2.498561 -1.468563
H  -1.162712 1.761057 -2.805582
H  -3.789626 -2.790628 1.193631
H  -2.190566 -1.945167 1.155173
H  -2.114096 0.376304 1.996989
H  -3.669144 1.072603 2.608027
H  0.805519 -0.18515 -1.865859
H  1.753482 1.27842 -2.433499
H  1.56337 -1.449811 0.16526
H  3.762473 2.063729 -1.15644
H  3.39518 -1.980497 1.794817
H  5.590726 1.532546 0.473396
H  5.410557 -0.49235 1.947749
