program: Gaussian 09
title: 000284508
version: EM64L-G09RevD.01
frameworkgroup: C1[X(C14H19NO4S2)]
method: RPBEPBE
basis: SDD
operation: Freq
keyword: #p
keyword: freq=noraman
keyword: PBEPBE/SDD
title: #p freq=noraman PBEPBE/SDD
converged: YES YES NO NO
title: Mulliken charges:
elementType: S S O O O O N C C C C C C C C C C C C C C H H H H H H H H H H H H H H H H H H H
charge: 0.950250 0.950408 -0.552941 -0.568678 -0.568730 -0.553029 -0.004416 0.202028 -0.396614 -0.395679 -0.654278 -0.654743 0.353801 -0.253989 -0.394573 -0.367763 -0.736717 -0.736580 -0.234425 -0.258589 -0.239785 0.275332 0.262176 0.262129 0.275051 0.301983 0.278542 0.301768 0.278629 0.259472 0.249091 0.296587 0.266406 0.265619 0.296558 0.266347 0.265591 0.235630 0.240213 0.237920
chargesum: 0.00000
title: Mulliken charges with hydrogens summed into heavy atoms:
elementType: S S O O O O N C C C C C C C C C C C C C C
charge: 0.950250 0.950408 -0.552941 -0.568678 -0.568730 -0.553029 -0.004416 0.202028 0.140894 0.141501 -0.073753 -0.074347 0.353801 -0.253989 -0.135101 -0.118672 0.091894 0.091916 0.001205 -0.018376 -0.001865
polarizability: 2.25943547e+02 1.80158858e-02 2.17248024e+02 -1.36296089e-01 -1.03831177e+01 2.01100270e+02
1716.lowfreq: -14.2925 -12.5797 -5.0868 -3.6860 -0.0029 -0.0027 -0.0017 0.2653 13.8751
frequency: -13.7408 -10.8381 13.7415 25.1100 33.6107 33.8371 60.7727 87.4308 90.0327 118.9101 121.7687 137.6854 146.7631 148.5237 163.5934 173.2806 209.0898 220.0020 228.2199 244.7429 246.8355 261.6062 271.2792 306.2145 322.3414 342.2256 350.4536 358.9202 394.5226 404.5225 410.9612 435.7465 513.9334 540.5494 547.8926 583.5494 589.9732 610.1847 616.8231 673.1958 694.0272 710.3230 776.8480 778.7659 783.6072 795.7262 802.0401 846.9181 861.2949 878.3910 888.3569 931.0680 947.6474 965.4079 966.2336 981.4073 986.5477 988.5908 990.2550 1006.1081 1023.1791 1025.6602 1045.7987 1061.8877 1075.3776 1080.6146 1099.1977 1131.1246 1148.4261 1177.9655 1203.2746 1222.0163 1222.1745 1232.4566 1283.6391 1298.6282 1299.7166 1326.1980 1327.6788 1331.3065 1365.9016 1379.9027 1406.2664 1406.8511 1413.7362 1415.3969 1425.5531 1425.6290 1436.0080 1467.3300 1480.8630 1484.8169 1590.7861 1610.0659 2184.1046 2994.7542 2997.3314 3028.3502 3028.3536 3041.5259 3042.0008 3068.0689 3071.8266 3129.3672 3135.5702 3139.7366 3140.1035 3144.7323 3154.9276 3170.1198 3177.6228 3177.6638 3181.3674 3181.3688
redmass: 4.8073 5.0002 6.7802 6.8640 4.1171 6.3036 4.1200 6.3804 3.8778 4.8917 8.4479 2.1044 1.1267 1.6662 3.2987 3.1232 3.6194 3.5116 3.6620 3.3345 3.6861 3.8529 3.8591 6.2825 6.4769 5.4586 4.8507 7.1919 6.4457 2.8907 4.6830 6.2066 3.9611 6.0148 6.9719 7.4589 5.7672 5.2502 6.3155 3.3588 5.0996 1.7104 1.8676 1.8343 2.3899 4.2277 2.4591 2.6149 1.2672 3.0059 2.4725 1.4465 1.3254 1.3793 1.4947 1.6045 1.6520 2.4333 5.8170 1.3335 2.6965 1.9891 2.0360 2.5015 3.9742 3.8811 1.6510 1.1328 2.1496 1.0542 1.1200 1.5076 1.2299 1.5146 1.1342 1.1457 1.1412 1.3372 1.2805 1.2873 1.3631 5.1462 1.0690 1.0662 1.0913 1.1077 1.0550 1.0558 2.2116 1.0791 1.1249 1.9747 5.9042 5.9022 12.6498 1.0618 1.0615 1.0249 1.0249 1.0557 1.0558 1.1007 1.1001 1.0858 1.0875 1.1103 1.1101 1.0921 1.0962 1.1015 1.1070 1.1070 1.1078 1.1078
irintensity: 0.3395 1.4189 2.1129 10.1076 0.4364 0.2899 4.6449 13.1966 2.7889 12.2373 2.5570 0.2467 2.1192 0.3596 4.0584 0.1123 1.2359 0.1002 15.3779 1.6377 8.2848 0.3886 2.3080 14.7810 5.6245 15.8906 3.3809 30.5498 35.2774 1.7790 0.7696 0.5489 12.4606 3.5310 6.0900 91.1472 9.0392 5.3699 0.2234 2.9848 1.2418 68.7809 33.1180 18.8395 0.1743 89.8547 6.8963 11.9553 0.8729 25.7274 51.2542 5.8772 15.0691 55.3970 16.5673 61.3505 1.7355 6.1681 5.2602 0.4529 2.8751 19.8440 29.5847 2.6450 0.1733 2.1253 6.4845 5.2513 1.0113 0.0177 0.3096 9.9878 7.9679 6.2589 6.7553 0.1146 5.3920 4.5705 23.7061 4.8503 1.6436 0.0752 21.0013 2.2241 0.1697 14.4987 5.3038 19.6111 13.4187 0.5507 40.0491 11.6414 1.3041 3.1840 5.2667 25.0614 2.9058 0.4431 2.0872 15.9263 1.8998 1.4233 13.0712 1.4671 0.5213 0.2517 2.0182 9.7410 19.1456 15.2276 0.5609 0.5889 0.4516 1.5077
temp: 298.150 k
press: 1.00000 atm
elementType: 16 16 8 8 8 8 7 6 6 6 6 6 6 6 6 6 6 6 6 6 6 1 1 1 1 1 1 1 1 1 1 1 1 1 1 1 1 1 1 1
symmnumber: 1
zpe: 799899.4 jmol-1
zpe.correction: 0.304666 hartree
zpe.thermalcorrener: 0.327622 hartree
zpe.thermalcorrenthalpy: 0.328566 hartree
zpe.thermalcorrgfe: 0.250036 hartree
zpe.sumelectzpe: -1694.715948 hartree
zpe.sumelectthermal: -1694.692992 hartree
zpe.sumelectthermalent: -1694.692048 hartree
zpe.sumelectthermalfe: -1694.770578 hartree
dipole: 0.0006 9.6500 2.3048
dipole: 9.9214
quadrupole: -131.4740 -150.1792 -163.0717
quadrupole: 0.0480 -0.0715 -3.7948
quadrupole: 16.7676 -1.9375 -14.8301 0.0480 -0.0715 -3.7948
hfenergy: -1695.020614 hartree
pointgroup: C01[X(C14H19N1O4S2)]
dipole: -0.0250521 3.6854089 1.2859336 debye
polarizability: 225.9430015|0.0853699|219.1723767|-0.0474604|-8.5472793|199.1764625 unknown
InChI: InChI=1S/C14H19NO4S2/c1-20(16,17)10-8-14(12-15,9-11-21(2,18)19)13-6-4-3-5-7-13/h3-7H,8-11H2,1-2H3
charge 0 multiplicity 1
40 atoms
S  4.00121 -1.119062 -0.661892
S  -3.990903 -1.16718 -0.672595
O  4.604866 -2.590255 -0.286493
O  3.389145 -0.808285 -2.15187
O  -3.383775 -0.843776 -2.161794
O  -4.569539 -2.649029 -0.299573
N  -0.00332 -1.079595 3.291664
C  0.00032 -0.562162 0.665019
C  1.272667 -1.240568 0.034111
C  -1.262682 -1.252336 0.027983
C  2.578988 -0.699961 0.612596
C  -2.576605 -0.726264 0.602679
C  -0.00636 0.962476 0.385354
C  -0.001777 -0.835445 2.123909
C  -0.015536 1.923492 1.426602
C  -0.003534 1.41164 -0.961918
C  5.361098 0.185944 -0.315768
C  -5.372426 0.114301 -0.324152
C  -0.022147 3.306654 1.129403
C  -0.010087 2.791248 -1.257385
C  -0.019546 3.745629 -0.212893
H  1.259387 -1.04783 -1.056515
H  1.214284 -2.334021 0.179318
H  -1.193695 -2.345401 0.171682
H  -1.247109 -1.057424 -1.062189
H  2.91142 -1.176514 1.547005
H  2.590969 0.400354 0.679119
H  -2.904059 -1.204242 1.538153
H  -2.602416 0.374015 0.665939
H  -0.017522 1.596171 2.472619
H  0.0039 0.693971 -1.789687
H  6.176774 -0.075452 -1.003969
H  4.930497 1.171326 -0.540647
H  5.661275 0.072213 0.735383
H  -6.183485 -0.159014 -1.013179
H  -4.957988 1.107094 -0.546784
H  -5.670914 -0.006664 0.726665
H  -0.02927 4.035663 1.94707
H  -0.007807 3.119001 -2.302346
H  -0.024701 4.816291 -0.444126
