program: Gaussian 09
title: 000284547
version: EM64L-G09RevD.01
frameworkgroup: C1[X(C22H28N6O)]
method: RPBEPBE
basis: SDD
operation: Freq
keyword: #p
keyword: freq=noraman
keyword: PBEPBE/SDD
title: #p freq=noraman PBEPBE/SDD
converged: YES YES NO NO
title: Mulliken charges:
elementType: O N N N N N N C C C C C C C C C C C C C C C C C C C C C C H H H H H H H H H H H H H H H H H H H H H H H H H H H H
charge: -0.290020 -0.309016 -0.098629 -0.176439 -0.133538 -0.633101 -0.614897 0.190555 0.316759 -0.687131 -0.706531 0.226609 0.502300 -0.572794 -0.346519 -0.356214 -0.537215 -0.420893 -0.412043 -0.025451 0.273028 -0.553650 0.499384 -0.645277 -0.441900 -0.366026 -0.220331 -0.229542 -0.240061 0.208492 0.234295 0.232114 0.228172 0.204267 0.239161 0.242286 0.232300 0.253987 0.256378 0.245469 0.244696 0.239698 0.238004 0.213271 0.277267 0.332422 0.341796 0.231911 0.252543 0.252169 0.318793 0.314148 0.230829 0.261448 0.226200 0.226877 0.229588
chargesum: 0.00000
title: Mulliken charges with hydrogens summed into heavy atoms:
elementType: O N N N N N N C C C C C C C C C C C C C C C C C C C C C C
charge: -0.290020 -0.309016 -0.098629 -0.176439 -0.133538 0.041117 0.018043 0.190555 0.316759 -0.012231 -0.034930 0.226609 0.502300 -0.098207 -0.092532 -0.099836 -0.047050 -0.181195 -0.174039 -0.025451 0.273028 -0.063111 0.499384 0.091347 -0.211071 -0.104578 0.005869 -0.002665 -0.010473
polarizability: 4.13744153e+02 7.64788632e+00 2.31880951e+02 8.48526646e+00 -5.76380407e+00 2.33852932e+02
1716.lowfreq: -7.9772 -4.1505 -1.7907 -0.0006 0.0010 0.0013 4.2762 11.4354 16.9383
frequency: -3.3777 11.2566 16.9233 20.6531 25.3501 33.5949 44.5588 47.4003 59.5790 77.9122 88.5275 94.6702 124.3468 135.4581 150.4208 172.2445 191.6905 216.5720 220.9562 237.2600 259.8753 268.3333 272.5915 297.9650 300.7058 305.1334 320.2191 337.1842 364.1077 369.2653 388.3503 397.9959 404.4338 409.4790 415.1537 430.8350 455.8852 490.8142 495.9086 512.5007 518.5268 521.7521 530.0406 541.4639 550.6099 566.3252 592.8827 602.0926 617.2520 624.8390 637.8517 666.5067 678.7472 706.3158 724.5804 738.6119 749.5962 782.8955 792.3333 809.6993 812.8868 819.9665 851.1333 856.6470 857.9474 870.8565 908.6461 910.3659 934.8915 942.9367 946.4254 963.7967 978.8790 979.8939 981.7281 988.7812 989.9273 996.9580 998.6309 1010.4529 1027.0245 1042.9108 1053.5998 1081.9113 1103.2371 1104.5411 1111.6284 1113.0536 1119.8624 1130.9586 1144.7885 1172.3869 1180.3371 1181.2243 1187.7925 1188.0445 1210.7215 1216.5712 1240.3880 1245.3580 1269.9836 1272.6303 1280.6363 1299.1003 1323.3513 1339.9719 1355.9389 1361.6091 1362.5151 1382.3245 1384.0018 1397.9585 1402.7233 1404.3763 1440.5794 1444.5375 1449.8496 1450.2771 1450.9797 1460.3482 1460.8885 1469.0520 1472.1839 1475.2298 1481.7681 1484.1266 1489.9125 1499.0440 1529.8910 1568.6159 1569.8547 1578.8258 1594.7504 1602.8713 1614.0946 1614.1955 1616.8923 2961.7366 2972.8857 2979.1762 2989.5103 2997.3898 3018.1231 3026.2469 3048.2227 3061.3041 3079.4401 3079.6335 3091.6959 3100.3279 3108.8190 3112.5433 3116.2536 3119.6001 3121.9923 3124.4591 3135.8416 3146.7599 3152.5728 3157.2790 3162.9991 3553.5616 3568.0199 3709.2481 3730.8383
redmass: 4.2565 4.8185 4.4002 4.5399 4.1111 3.5427 4.8781 3.7720 1.8674 2.4341 3.4479 4.1619 3.8375 5.0524 2.4040 4.9843 5.3771 2.6721 1.2237 4.4806 3.1262 1.0479 4.0899 4.3958 3.5048 2.6033 2.9119 2.6089 1.7064 1.7506 1.2042 2.1355 2.8013 3.2567 3.0067 3.3058 3.3109 2.1854 3.0420 2.2256 2.6425 1.7390 1.7697 3.7379 2.9559 3.2621 3.3383 4.3323 6.2448 4.5842 6.7295 5.3614 6.9031 1.8625 10.6679 3.3822 2.3828 4.4353 1.3861 2.9084 3.4811 2.5125 1.3602 2.1621 1.3791 2.4749 1.5884 1.6325 5.0487 2.0889 1.8029 1.4110 1.3965 1.4492 2.0192 1.3296 5.2951 1.8600 1.3498 2.7354 2.1989 3.2389 3.6042 1.5964 1.3800 1.9583 1.4003 1.7258 2.1908 2.0569 1.1361 1.0615 1.2142 1.8553 1.1311 3.2004 2.6367 2.2271 4.2904 2.0038 1.5989 3.4185 1.3117 1.3338 1.3634 1.4855 1.3516 1.5893 2.4425 5.6223 1.2710 2.4239 4.0707 3.0890 1.7886 1.1363 1.0628 1.5244 2.8430 1.1211 1.1457 1.0712 1.0982 1.0680 1.0986 2.0863 1.1052 2.7480 2.5901 2.1322 4.0876 6.7365 6.0452 2.4283 5.9531 2.6635 3.5894 1.0427 1.0604 1.0345 1.0627 1.0352 1.0608 1.0987 1.0946 1.0991 1.1030 1.1003 1.0999 1.1005 1.0994 1.0877 1.0963 1.0890 1.0889 1.0861 1.0914 1.0962 1.0949 1.0962 1.1015 1.0443 1.0436 1.1053 1.1058
irintensity: 0.6794 0.5221 0.2737 1.1331 0.8911 0.3345 3.2270 0.3823 0.3114 0.6470 0.9762 1.5188 0.2927 2.8121 1.2027 0.1040 6.0942 6.3216 1.2232 3.5516 1.5463 0.4500 2.0513 8.2719 2.1346 12.1827 0.8909 8.4435 141.1161 65.2053 204.7017 9.1248 0.3077 3.4357 2.7897 18.7517 4.8549 49.4141 3.4165 16.8278 2.5905 13.6142 37.3590 0.3065 1.3703 10.6610 33.8691 12.6161 0.2102 6.5860 0.7194 0.6376 5.9799 51.3539 31.1734 21.3676 24.3917 6.4222 4.2628 18.4969 19.2144 32.4545 2.8609 23.4571 4.2775 4.7333 3.2012 3.2210 9.2829 1.9732 5.2906 0.1212 0.5507 0.8669 6.1972 1.7487 0.3093 3.5999 1.0859 6.8419 7.7974 50.2669 11.9622 8.8703 10.8240 4.0213 17.3673 84.5331 2.2363 39.5060 2.9132 0.9188 4.3815 14.9494 2.0557 31.3962 4.4372 0.7618 23.6793 37.8195 156.5810 44.7541 14.8331 0.9928 16.5011 12.6887 12.4922 23.6543 9.7070 34.7556 28.0268 89.2658 374.0979 10.7277 22.4785 16.2143 1.9041 36.2704 90.5655 9.9522 30.6951 10.1802 15.7643 25.2458 16.3245 30.5173 12.8088 99.5451 295.2511 144.5080 55.2758 220.7712 1.8400 611.0999 16.1883 170.2155 351.3703 51.5979 11.4510 17.4098 50.5979 19.0434 14.8275 7.2301 20.7589 10.5943 14.4557 28.8807 14.1152 34.6386 30.8854 9.2498 17.7251 9.3603 26.1991 0.1245 13.8128 34.5297 13.3516 1.2280 24.7400 56.1077 83.9784 58.5911 36.1228
temp: 298.150 k
press: 1.00000 atm
elementType: 8 7 7 7 7 7 7 6 6 6 6 6 6 6 6 6 6 6 6 6 6 6 6 6 6 6 6 6 6 1 1 1 1 1 1 1 1 1 1 1 1 1 1 1 1 1 1 1 1 1 1 1 1 1 1 1 1
symmnumber: 1
zpe: 1231911.3 jmol-1
zpe.correction: 0.469210 hartree
zpe.thermalcorrener: 0.497408 hartree
zpe.thermalcorrenthalpy: 0.498352 hartree
zpe.thermalcorrgfe: 0.406693 hartree
zpe.sumelectzpe: -1256.772611 hartree
zpe.sumelectthermal: -1256.744414 hartree
zpe.sumelectthermalent: -1256.743469 hartree
zpe.sumelectthermalfe: -1256.835129 hartree
dipole: 3.1724 1.0384 -0.7934
dipole: 3.4310
quadrupole: -178.0065 -176.0796 -160.7699
quadrupole: 28.1299 -7.0097 -0.3504
quadrupole: -6.3878 -4.4610 10.8488 28.1299 -7.0097 -0.3504
hfenergy: -1257.2418212 hartree
pointgroup: C01 [X(C22H28N6O1)]
dipole: -1.2432982 0.3851742 0.3577792 debye
polarizability: 413.7650001|-9.294531|230.9517|6.3527646|5.5261432|234.7613356 unknown
InChI: InChI=1S/C22H28N6O/c1-22(2)26-20(23)25-21(24)28(22)18-12-9-16(10-13-18)11-14-19(29)27(3)15-17-7-5-4-6-8-17/h4-10,12-13H,11,14-15,23-24H2,1-3H3
charge 0 multiplicity 1
57 atoms
O  -3.750259 -2.189177 0.00342
N  4.560615 -0.004722 -0.10458
N  6.309337 1.53527 0.749904
N  6.884244 -0.505139 -0.492192
N  -4.272445 -0.267355 1.204343
N  5.24443 -2.015957 -1.170908
N  8.516268 0.757587 0.593385
C  4.930028 1.456097 0.247257
C  3.190091 -0.454543 -0.104019
C  4.792251 2.320881 -1.038264
C  3.985734 1.967394 1.352423
C  5.583115 -0.811795 -0.586342
C  0.471703 -1.351308 -0.075862
C  -0.984235 -1.787741 -0.041426
C  2.345763 -0.230795 -1.22316
C  2.670679 -1.143981 1.02158
C  -1.892548 -0.680027 0.550972
C  1.004837 -0.673052 -1.202698
C  1.330221 -1.5830 1.03155
C  7.171011 0.636956 0.286984
C  -3.369221 -1.108006 0.561438
C  -5.695748 -0.682737 1.297093
C  -6.618136 0.140634 0.403926
C  -3.922853 1.008825 1.847896
C  -7.676108 0.906053 0.95217
C  -6.428699 0.136728 -1.003024
C  -8.534274 1.655637 0.113072
C  -7.282106 0.884806 -1.841798
C  -8.338088 1.647626 -1.286152
H  3.746127 2.354486 -1.394675
H  5.120317 3.350522 -0.812847
H  5.439391 1.920577 -1.839146
H  4.075579 1.339003 2.254459
H  2.93234 1.990969 1.023186
H  4.303922 2.989262 1.616566
H  -1.34933 -2.036379 -1.053141
H  -1.106072 -2.703503 0.564162
H  2.748589 0.282297 -2.10312
H  3.330041 -1.328108 1.876368
H  -1.557265 -0.428832 1.576138
H  -1.778221 0.246866 -0.047316
H  0.365027 -0.499556 -2.076992
H  0.943879 -2.120296 1.906641
H  -6.01626 -0.600877 2.354128
H  -5.721165 -1.746858 1.002468
H  6.012469 -2.622609 -1.445501
H  4.277963 -2.281732 -1.338479
H  -3.816522 0.89633 2.946057
H  -2.983952 1.416914 1.445966
H  -4.721748 1.745834 1.649812
H  9.149906 0.015317 0.31391
H  8.829187 1.550631 1.145026
H  -7.834453 0.911481 2.038406
H  -5.617869 -0.464832 -1.430441
H  -9.350429 2.242679 0.549291
H  -7.131204 0.870032 -2.9272
H  -9.001456 2.226819 -1.938308
