program: Gaussian 09
title: 000284471
version: EM64L-G09RevD.01
frameworkgroup: C1[X(C16H16O4S2)]
method: RPBEPBE
basis: SDD
operation: Freq
keyword: #p
keyword: freq=noraman
keyword: PBEPBE/SDD
title: #p freq=noraman PBEPBE/SDD
converged: YES YES NO NO
title: Mulliken charges:
elementType: S S O O O O C C C C C C C C C C C C C C C C H H H H H H H H H H H H H H H H
charge: 0.866443 0.867094 -0.529526 -0.529289 -0.529503 -0.529232 -0.102211 -0.102342 -0.252076 -0.250333 -0.235230 -0.235003 -0.235255 -0.235015 0.446442 0.448087 -0.362499 -0.363944 -0.361838 -0.362958 -0.797173 -0.797219 0.308170 0.308046 0.290161 0.290320 0.289979 0.290111 0.246838 0.246837 0.246809 0.246805 0.231809 0.231767 0.245714 0.232171 0.232249 0.244795
chargesum: 0.00000
title: Mulliken charges with hydrogens summed into heavy atoms:
elementType: S S O O O O C C C C C C C C C C C C C C C C
charge: 0.866443 0.867094 -0.529526 -0.529289 -0.529503 -0.529232 -0.102211 -0.102342 0.056095 0.057712 0.054931 0.055317 0.054724 0.055096 0.446442 0.448087 -0.115661 -0.117107 -0.115029 -0.116153 -0.087883 -0.088006
polarizability: 3.94316010e+02 3.03166247e+01 1.71782450e+02 2.76028329e-02 -4.37898058e-02 2.12093446e+02
1716.lowfreq: -140.8644 -26.8180 -4.7603 0.0020 0.0022 0.0024 0.3711 2.4390 10.1783
frequency: -140.8632 -26.4796 -1.4157 21.8475 30.6621 38.7864 39.3860 44.2034 68.1421 100.0622 111.2361 116.2194 127.6180 133.1022 191.6818 202.0234 218.2957 228.3648 260.4030 292.7787 295.1381 295.5568 337.3819 361.1304 365.6593 377.2261 397.6140 408.0506 408.1525 424.8041 450.1032 496.6208 510.8181 547.5494 583.4196 591.1076 621.3815 621.5663 629.3944 708.7456 709.5519 710.3492 774.8044 775.7432 796.4561 802.8685 828.2396 829.7190 850.4938 850.8273 892.9868 928.6741 934.5199 963.3872 964.0409 982.3593 983.6763 990.6602 991.1411 993.9086 994.4718 1049.5827 1050.0968 1053.4743 1053.8660 1096.5028 1118.8644 1119.0067 1175.8570 1184.3461 1185.2297 1217.3670 1217.8463 1296.9261 1296.9615 1381.2118 1381.4900 1391.3881 1391.4572 1399.1748 1400.3296 1469.7720 1470.6999 1472.8489 1473.0282 1474.6017 1474.6549 1585.5564 1594.4537 1594.6843 1594.8578 1595.0216 2981.5829 2981.8525 3064.7476 3064.8636 3093.7950 3094.7354 3136.9828 3137.0581 3138.1052 3138.1870 3158.6181 3158.6852 3161.8460 3161.9178 3165.2800 3178.5791
redmass: 2.0298 1.0196 6.2521 5.6996 3.9078 4.2282 5.9209 1.0128 9.3005 4.8301 6.5265 6.6136 7.2711 7.0116 6.5002 5.4836 8.2170 7.2353 6.0807 4.4836 5.4112 7.2380 3.6426 6.0119 9.3140 3.3784 5.2163 2.8669 2.8811 11.4203 6.3089 3.0695 3.6402 6.9610 5.5796 6.3178 6.9384 6.9591 4.7508 3.3418 3.3631 2.1271 5.3376 5.3141 11.1644 8.8793 1.3555 1.4231 1.2413 1.2429 1.1246 15.9678 10.1646 1.2988 1.3024 1.3881 1.3783 1.4055 1.4005 5.5210 5.5389 1.5989 1.6017 2.4661 2.4761 1.1212 1.2852 1.2860 1.1632 1.1406 1.1448 3.0246 3.0069 1.2627 1.2626 6.1314 6.1333 3.0009 2.9897 1.2184 1.2177 1.1017 1.1014 2.3138 2.3311 1.0631 1.0697 7.3570 5.9918 6.0102 6.9558 6.9446 1.0390 1.0392 1.0948 1.0946 1.1001 1.1002 1.0887 1.0887 1.0890 1.0890 1.0959 1.0959 1.0973 1.0974 1.0854 1.1118
irintensity: 0.0004 0.8387 3.9287 3.5024 0.3567 0.0263 0.0011 0.5724 3.9199 8.7443 0.0020 0.0004 1.0988 0.0059 0.0066 31.7865 0.0276 2.5192 0.0921 0.1293 2.2881 26.0281 4.6046 36.2459 0.7254 0.0036 1.5834 0.0060 0.0001 115.2429 0.1454 35.0287 0.0638 217.7474 0.3405 188.9555 0.0108 0.3779 0.0073 2.8565 1.2441 0.0037 21.7013 6.6132 142.5746 0.2095 68.7516 0.4463 0.0807 0.0108 22.7873 0.0122 171.4052 1.0678 1.5818 0.0208 0.1347 1.4423 3.2902 6.4050 1.7434 19.8316 30.7635 58.6211 0.8461 14.1265 2.4259 13.3025 0.0024 32.5608 0.4377 12.9871 5.6265 0.7917 4.5062 0.1185 0.1760 5.0765 16.4167 17.1867 17.2665 17.0058 18.2012 47.0444 6.4336 12.0660 15.6969 0.0002 18.6918 0.6493 0.0174 0.0798 25.8625 20.6606 16.2465 20.6572 13.9147 13.8972 10.6464 14.5167 8.1285 3.2626 0.7182 0.7158 22.6087 8.4721 11.1015 0.0001
temp: 298.150 k
press: 1.00000 atm
elementType: 16 16 8 8 8 8 6 6 6 6 6 6 6 6 6 6 6 6 6 6 6 6 1 1 1 1 1 1 1 1 1 1 1 1 1 1 1 1
symmnumber: 1
zpe: 725434.1 jmol-1
zpe.correction: 0.276303 hartree
zpe.thermalcorrener: 0.297775 hartree
zpe.thermalcorrenthalpy: 0.298719 hartree
zpe.thermalcorrgfe: 0.223324 hartree
zpe.sumelectzpe: -1714.350279 hartree
zpe.sumelectthermal: -1714.328808 hartree
zpe.sumelectthermalent: -1714.327863 hartree
zpe.sumelectthermalfe: -1714.403259 hartree
dipole: -0.0707 0.1387 -0.0735
dipole: 0.1722
quadrupole: -67.8943 -171.9420 -144.7960
quadrupole: 27.7484 0.0124 -0.0168
quadrupole: 60.3165 -43.7313 -16.5852 27.7484 0.0124 -0.0168
hfenergy: -1714.6265825 hartree
pointgroup: C01 [X(C16H16O4S2)]
dipole: 0.0271731 0.0548698 0.028959 debye
polarizability: 395.011208|-27.6389235|171.0872116|0.0116627|0.0167576|212.0934866 unknown
InChI: InChI=1S/C16H16O4S2/c1-13-3-7-15(8-4-13)21(17,18)11-12-22(19,20)16-9-5-14(2)6-10-16/h3-12H,1-2H3
charge 0 multiplicity 1
38 atoms
S  1.839018 1.445322 -0.014994
S  -1.840684 -1.457733 -0.015715
O  1.626592 2.226185 1.404129
O  1.638324 2.215241 -1.441778
O  -1.628985 -2.238886 1.403343
O  -1.641168 -2.227488 -1.442742
C  3.547659 0.635654 -0.005444
C  -3.547629 -0.644254 -0.005823
C  0.65914 -0.099984 -0.013959
C  -0.659554 0.086536 -0.014648
C  4.158338 0.366142 -1.240384
C  -4.159178 -0.376279 -1.240647
C  4.148965 0.373981 1.235784
C  -4.149391 -0.384126 1.235501
C  6.095863 -0.517283 0.007839
C  -6.094812 0.511065 0.007905
C  5.443755 -0.219119 -1.218782
C  -5.445461 0.207091 -1.218813
C  5.434481 -0.211373 1.227598
C  -5.435768 0.199342 1.227528
C  7.489372 -1.118023 0.015135
C  -7.462704 1.167484 0.0155
H  1.208789 -1.046896 -0.013177
H  -1.208793 1.033679 -0.015121
H  3.656261 0.624547 -2.17867
H  -3.660196 -0.641421 -2.178707
H  3.63984 0.638256 2.168619
H  -3.643053 -0.655135 2.167923
H  5.946576 -0.444516 -2.166061
H  -5.951832 0.424492 -2.166084
H  5.930126 -0.430747 2.180068
H  -5.934614 0.410718 2.18015
H  7.658696 -1.74135 0.910002
H  7.667941 -1.74183 -0.877574
H  8.258612 -0.321707 0.018949
H  -8.048951 0.896222 -0.879287
H  -8.04556 0.882516 0.908278
H  -7.367217 2.270576 0.023858
