program: Gaussian 09
title: 000284437
version: EM64L-G09RevD.01
frameworkgroup: C1[X(C9H9IO2S)]
method: RPBEPBE
basis: SDD
operation: Freq
keyword: #p
keyword: freq=noraman
keyword: PBEPBE/SDD
title: #p freq=noraman PBEPBE/SDD
converged: NO NO NO NO
title: Mulliken charges:
elementType: I S O O C C C C C C C C C H H H H H H H H H
charge: 0.174604 0.930250 -0.536816 -0.536839 0.355045 -0.316898 -0.296080 -0.755047 -0.339970 -0.339967 -0.209726 -0.209729 -0.228578 0.268316 0.267033 0.289529 0.267015 0.254914 0.254903 0.235926 0.235927 0.236188
chargesum: 0.00000
title: Mulliken charges with hydrogens summed into heavy atoms:
elementType: I S O O C C C C C C C C C
charge: 0.174604 0.930250 -0.536816 -0.536839 0.355045 -0.048582 -0.296080 0.068529 -0.085056 -0.085063 0.026201 0.026198 0.007610
polarizability: 2.08291790e+02 4.54256505e+00 1.45436896e+02 1.23302670e-04 -2.61253839e-03 1.21543938e+02
1716.lowfreq: -39.2023 -17.5654 -10.7740 -0.0009 0.0012 0.0016 4.5496 9.0881 56.6765
frequency: -39.1788 -6.6645 56.6759 56.7924 83.1005 154.1086 158.2633 184.1189 185.3599 221.7552 233.3426 313.5129 349.1111 356.5580 393.9472 421.1925 507.8917 522.5679 537.4612 578.7377 614.9538 656.3411 699.0818 713.2799 771.2973 795.5657 844.3275 849.1608 891.6968 924.2887 971.2831 975.4861 986.8702 998.5607 1006.5655 1026.2930 1079.7959 1172.3155 1175.1218 1187.8962 1210.0794 1300.5192 1310.4954 1372.0444 1408.9234 1424.1239 1428.8245 1470.6272 1581.6351 1594.7051 1610.5946 3029.7588 3132.8368 3139.8209 3141.8057 3150.5441 3159.6860 3172.4728 3180.9446 3181.4948
redmass: 4.0764 7.8865 5.8453 6.1230 14.1992 5.0348 6.4420 1.0957 4.7562 5.3426 3.9105 8.7772 4.4855 7.3709 2.8321 6.0209 4.5496 4.1907 6.7562 6.7767 6.1355 4.9826 1.7056 1.4383 1.9496 11.4371 5.1453 1.2450 2.7965 1.4103 1.3755 1.3855 5.8997 1.3350 2.0354 2.1775 1.6040 1.1562 1.0536 1.1186 3.9213 1.1406 1.3630 6.7302 1.0524 1.0563 2.2171 2.2142 5.9182 7.2921 7.6415 1.0249 1.0850 1.0881 1.0941 1.0928 1.0972 1.1019 1.1066 1.1082
irintensity: 0.0040 5.4399 0.0680 1.2684 2.1971 0.9656 8.3232 0.0305 0.4714 0.1752 0.3892 27.8466 1.1129 46.7897 0.0693 13.8794 44.9807 12.1521 11.7181 48.3464 0.3708 28.9338 63.3338 32.0974 46.2600 28.4637 57.0666 0.0190 28.6751 0.1120 46.7644 0.0095 1.6345 0.0020 71.7697 7.1236 8.7729 15.6341 0.0029 4.4180 47.5508 6.6487 0.2703 0.2807 12.7869 11.8038 11.1143 15.5684 1.5598 46.9870 35.8000 1.3625 0.4581 1.2183 4.1782 10.4348 23.4268 21.6621 0.4596 1.6817
temp: 298.150 k
press: 1.00000 atm
elementType: 53 16 8 8 6 6 6 6 6 6 6 6 6 1 1 1 1 1 1 1 1 1
symmnumber: 1
zpe: 404676.4 jmol-1
zpe.correction: 0.154133 hartree
zpe.thermalcorrener: 0.166667 hartree
zpe.thermalcorrenthalpy: 0.167611 hartree
zpe.thermalcorrgfe: 0.113408 hartree
zpe.sumelectzpe: -907.213012 hartree
zpe.sumelectthermal: -907.200478 hartree
zpe.sumelectthermalent: -907.199534 hartree
zpe.sumelectthermalfe: -907.253737 hartree
dipole: -4.8110 -4.8334 -0.0030
dipole: 6.8197
quadrupole: -96.7779 -84.9515 -100.9959
quadrupole: -7.5494 -0.0110 0.0086
quadrupole: -2.5361 9.2902 -6.7541 -7.5494 -0.0110 0.0086
hfenergy: -907.3671448 hartree
pointgroup: C01 [X(C9H9I1O2S1)]
dipole: -1.8493064 1.9439333 0.0098688 debye
dipolederiv: -0.0826326 0.1576515 0.0007209 0.1618288 -0.5811288 -0.0029611 0.0007718 -0.0029782 0.0775264 1.8255357 0.460703 0.00204 0.1395467 1.2563398 0.0001589 0.0008448 0.0002216 1.2512035 -0.7243382 -0.0705717 -0.0426046 -0.0157148 -0.4861509 -0.0024607 -0.127454 0.1010586 -0.6201162 -0.7243594 -0.0711365 0.0419149 -0.0169136 -0.4851798 0.0037412 0.1272636 -0.0998132 -0.6211665 -0.0697327 0.0327397 0.000192 -0.2001023 -0.2118314 -0.0011599 -0.0009843 -0.0011324 0.0566007 -0.4561569 -0.1965161 -0.0008354 -0.2520654 -0.6150056 -0.0012418 -0.0013086 -0.0013053 -0.3634104 0.4988301 -0.2601397 -0.0011803 0.2089845 1.3120989 0.006551 0.0009877 0.0065018 -0.1547374 -0.165316 -0.0348102 -0.0001411 -0.0915454 -0.2873984 -0.0009436 -0.0004463 -0.0010225 -0.0943451 -0.0797886 -0.0313604 -0.0890158 -0.0110891 -0.1256409 0.0332507 0.1215829 -0.0248826 0.041598 -0.0797809 -0.0321935 0.0887311 -0.0100609 -0.1255116 -0.0347933 -0.1217007 0.023363 0.0416441 -0.0798145 -0.0030021 0.1141907 -0.002985 -0.1176869 -0.0287334 0.102676 -0.0462833 0.0702514 -0.0798896 -0.0018905 -0.1141635 -0.002082 -0.1183593 0.0270879 -0.1027267 0.0445465 0.0707516 0.0969319 -0.0533238 -0.0002441 -0.0519709 -0.1398393 -0.0005131 -0.0002334 -0.0004613 -0.0311812 -0.0741046 -0.058441 -0.0002599 0.0249512 -0.0342292 -0.0009491 0.0001589 -0.000876 0.1975686 0.0813331 0.0052061 0.052894 -0.0128253 -0.0013438 -0.0472891 0.0683063 -0.0277216 0.0050265 -0.0121997 -0.0051778 -0.0000595 -0.0158445 0.070043 -0.0002335 -0.00009 -0.0002036 0.114408 0.0813491 0.0057539 -0.0528256 -0.0121871 -0.0021096 0.0471718 -0.0684221 0.0276693 0.00577 0.0700009 0.0169892 0.0845485 0.0157254 0.1250816 -0.0196597 0.0720973 -0.0155705 -0.0130995 0.0700372 0.017738 -0.0844334 0.0163787 0.1247523 0.0209241 -0.0719245 0.0167911 -0.0128124 0.0093711 0.030966 -0.0771787 0.0321197 0.1512952 0.0191479 -0.0974515 0.024072 -0.0562259 0.009378 0.0302524 0.0774231 0.0312541 0.1516663 -0.0172997 0.0977638 -0.0221918 -0.0565577 -0.1146534 0.0605635 0.0002867 0.0645973 0.1401383 0.0002041 0.000289 0.0002184 0.0913035 unknown
polarizability: 208.0541321|-5.9594759|145.6741025|-0.0322873|0.1042986|121.5443892 unknown
InChI: InChI=1S/C9H9IO2S/c1-13(11,12)7-9(10)8-5-3-2-4-6-8/h2-7H,1H3
charge 0 multiplicity 1
22 atoms
I  0.712566 -2.592225 -0.011653
S  3.069181 0.175614 0.000277
O  3.53011 -0.494235 1.413078
O  3.529839 -0.479708 -1.419417
C  -1.223562 -0.165547 -0.00078
C  1.178418 0.473568 0.001782
C  0.231353 -0.486234 -0.002213
C  3.687085 1.997393 0.009584
C  -1.919103 -0.004313 -1.227954
C  -1.919017 -0.015233 1.227828
C  -3.295001 0.311672 -1.222471
C  -3.294909 0.300804 1.225267
C  -3.985861 0.464829 0.002128
H  0.941017 1.544514 0.0061
H  3.315075 2.466129 0.931094
H  4.782147 1.909753 0.009338
H  3.315393 2.475391 -0.907285
H  -1.382707 -0.132624 -2.174171
H  -1.382577 -0.152058 2.172828
H  -3.826156 0.43631 -2.172109
H  -3.825996 0.416998 2.176012
H  -5.053996 0.707206 0.003235
