program: Gaussian 09
title: 000284429
version: EM64L-G09RevD.01
frameworkgroup: C1[X(C10H11ClO2S)]
method: RPBEPBE
basis: SDD
operation: Freq
keyword: #p
keyword: freq=noraman
keyword: PBEPBE/SDD
title: #p freq=noraman PBEPBE/SDD
converged: NO YES NO NO
title: Mulliken charges:
elementType: Cl S O O C C C C C C C C C C H H H H H H H H H H H
charge: -0.066777 0.874311 -0.544238 -0.543585 -0.356294 -0.430322 -0.430064 -0.360075 -0.043755 -0.259646 -0.261761 -0.204090 -0.203616 -0.216733 0.281204 0.315922 0.259109 0.259007 0.316185 0.310458 0.288846 0.289706 0.243320 0.243309 0.239578
chargesum: 0.00000
title: Mulliken charges with hydrogens summed into heavy atoms:
elementType: Cl S O O C C C C C C C C C C
charge: -0.066777 0.874311 -0.544238 -0.543585 -0.075090 0.144709 0.145128 -0.049616 -0.043755 0.029200 0.027945 0.039230 0.039693 0.022845
polarizability: 2.02089711e+02 5.71930715e-01 1.32819692e+02 1.04655981e+01 -1.94599693e+00 9.83394667e+01
1716.lowfreq: -13.7791 -7.3832 -0.0022 -0.0020 0.0007 6.1329 14.8804 30.5670 37.4384
frequency: 13.4901 30.4761 37.3701 71.2468 127.6461 163.5087 181.1596 191.4166 243.9254 245.1773 313.3341 336.3262 366.9868 395.1145 404.9118 427.1946 467.2161 520.7732 542.0311 603.0462 659.3671 693.5290 761.1463 785.6272 789.6630 792.1329 854.8602 910.8279 915.8621 919.2706 936.0250 979.0123 984.9509 997.7523 1006.0740 1006.8774 1010.4862 1029.8227 1050.1288 1069.3114 1076.2874 1116.7661 1173.7395 1177.1796 1185.5734 1196.3942 1238.7928 1245.3587 1261.4624 1278.1646 1302.3422 1383.3407 1425.1954 1435.5344 1436.4978 1452.7652 1578.4613 1603.0080 3024.3537 3027.8447 3089.1895 3099.6153 3103.4850 3116.4164 3137.3635 3146.1024 3153.9083 3163.2798 3174.1685
redmass: 3.8775 7.9022 4.0102 5.1454 5.9802 6.1650 7.5051 5.5941 8.5918 7.5556 3.9276 7.7857 3.4572 4.0014 2.8362 4.0122 3.8002 5.3060 3.9330 6.4775 6.9824 2.3939 1.4555 8.1632 1.3879 6.2760 1.2425 2.8259 6.3569 1.8811 1.3565 5.8375 1.3877 3.4766 1.3528 2.0198 2.4114 3.0546 2.1781 1.2735 1.5452 1.4441 1.0569 1.1254 1.5284 1.2480 1.3595 1.3473 1.2329 1.3937 1.3036 8.5215 1.0770 2.2052 1.0949 2.0367 5.8197 6.9030 1.0586 1.0613 1.0939 1.0986 1.1046 1.0943 1.0857 1.0882 1.0927 1.0970 1.1017
irintensity: 0.1137 1.3156 0.3800 3.6709 3.9262 0.9555 1.9485 7.3502 9.0796 0.4918 0.0125 22.5929 43.2663 0.2061 0.0047 1.4084 36.2008 88.7151 2.0334 0.0082 3.4494 34.2890 79.4383 38.5696 1.1193 39.6133 0.8202 12.5310 45.2133 35.3908 1.9088 4.0956 0.1430 3.4430 1.6161 8.0633 1.4093 34.8878 21.3006 0.1880 4.9729 1.3840 0.0278 9.4304 0.1899 38.8551 1.3203 0.3698 5.6504 35.1519 3.7288 4.3132 47.9076 13.2245 5.7899 15.0840 4.3600 0.4918 3.9844 9.4126 6.6392 5.2994 0.0710 9.8107 0.9882 8.4929 0.3773 5.4370 29.4370
temp: 298.150 k
press: 1.00000 atm
elementType: 17 16 8 8 6 6 6 6 6 6 6 6 6 6 1 1 1 1 1 1 1 1 1 1 1
symmnumber: 1
zpe: 488301.7 jmol-1
zpe.correction: 0.185984 hartree
zpe.thermalcorrener: 0.199941 hartree
zpe.thermalcorrenthalpy: 0.200885 hartree
zpe.thermalcorrgfe: 0.142132 hartree
zpe.sumelectzpe: -1395.008748 hartree
zpe.sumelectthermal: -1394.994792 hartree
zpe.sumelectthermalent: -1394.993848 hartree
zpe.sumelectthermalfe: -1395.052600 hartree
dipole: -4.0588 -0.3611 -4.8995
dipole: 6.3726
quadrupole: -92.2768 -94.7176 -106.2019
quadrupole: 0.6095 7.9576 -0.7620
quadrupole: 5.4553 3.0145 -8.4697 0.6095 7.9576 -0.7620
hfenergy: -1395.1947326 hartree
pointgroup: C01 [X(C10H11Cl1O2S1)]
dipole: -1.6286118 1.6091 -1.0219087 debye
dipolederiv: -0.7717298 -0.0956248 0.0333584 -0.2212379 -0.2212606 0.01322 0.1070924 0.0179983 -0.1909026 1.575467 -0.0599329 0.0627999 -0.0133281 1.089195 -0.0615274 0.0358873 -0.0640427 1.0219998 -0.742784 -0.0129022 -0.0067532 -0.0570056 -0.4752884 0.0137855 0.0005323 0.0687108 -0.6848586 -0.7448954 0.0030441 -0.000818 -0.0273754 -0.6718319 -0.0406418 0.0367425 -0.0919803 -0.4849016 0.1434882 0.0384239 -0.0147747 0.2610014 0.0351196 -0.0361676 -0.145147 -0.0446245 -0.0258413 -0.1352342 0.0263841 -0.018349 -0.1824701 -0.0423388 0.002251 0.102783 0.0027742 -0.1344359 -0.1345543 0.0298396 -0.0169717 -0.1781816 -0.1186505 -0.0487491 0.1052954 -0.0343313 -0.0564551 0.9634936 0.1974923 -0.0842126 0.2127013 0.2535675 -0.0522176 -0.0934443 -0.0522104 0.1780455 0.0274759 -0.0302689 0.0228709 -0.1153319 -0.1724945 0.0415931 0.0733843 0.0457975 -0.1140828 -0.26176 -0.0475198 -0.1068086 0.1219333 -0.0717351 0.1000051 0.1195823 -0.0356402 -0.0670197 -0.255229 0.055493 0.0821338 -0.045382 -0.0955745 -0.0486131 -0.1884061 0.0832404 -0.0493238 -0.0459877 0.0341615 0.1322113 -0.0246696 -0.0893529 0.0470924 0.0346925 0.0884646 0.069255 -0.0312086 -0.1037022 -0.1054277 -0.052383 -0.0362264 0.1147123 -0.0027632 0.0736437 0.0011127 0.0946235 -0.0917072 0.0592741 -0.0785381 -0.0770998 0.0286472 0.0514334 0.0281912 -0.033512 -0.1338951 0.0024809 -0.0086785 0.0411673 -0.0188549 0.046192 -0.0302934 0.0444501 0.0306312 0.1337221 -0.0379838 -0.053255 0.0423447 0.0294377 -0.0673778 -0.0670798 -0.0223641 0.103796 -0.0017466 -0.0411791 0.0648323 0.017289 0.0810697 0.0778012 0.018103 0.0661011 0.0038692 0.0025942 -0.0759557 -0.0036245 -0.0057326 -0.0418421 -0.0025917 -0.0313595 0.0041733 0.122442 0.1266372 0.0285548 0.0650329 0.0765274 0.1276679 0.0383485 0.0022173 -0.0108913 0.0123786 -0.0485624 -0.0320176 0.0140705 0.0164194 -0.0341661 0.0621396 -0.0136022 0.0600523 0.0360833 0.1354846 0.0533987 0.0478262 0.0341419 0.1043901 -0.0561069 0.0380176 -0.0290753 0.1028799 0.1471524 -0.0120608 -0.063404 -0.0149067 0.1396487 -0.0124539 -0.03949 -0.0382518 0.0595236 0.0238328 0.0116562 -0.0824021 0.014155 0.1176583 -0.0662944 -0.0977384 -0.0655447 -0.0286441 0.0098034 0.0823085 0.0349098 0.0964926 0.0731244 -0.0870587 0.0402256 -0.0883845 0.0296207 -0.0761877 0.0776174 -0.0538403 0.082369 0.1158378 -0.005988 -0.056665 -0.0062563 0.09834 unknown
polarizability: 202.3372002|-6.2491308|106.1970713|6.4587203|14.9303901|124.7145979 unknown
InChI: InChI=1S/C10H11ClO2S/c11-8-6-10(7-8)14(12,13)9-4-2-1-3-5-9/h1-5,8,10H,6-7H2
charge 0 multiplicity 1
25 atoms
Cl 5.295151 0.815256 -0.09772
S  0.303178 -0.787297 0.650898
O  0.428724 -0.733735 2.285656
O  0.543951 -2.185913 -0.172291
C  1.578539 0.568202 -0.09017
C  2.675445 -0.148635 -0.917966
C  2.605035 0.965117 1.001599
C  3.63697 0.028221 0.298725
C  -1.419999 -0.151786 0.194091
C  -1.972596 -0.569819 -1.027574
C  -2.086678 0.668458 1.11876
C  -3.270775 -0.109205 -1.350195
C  -3.384231 1.117702 0.777821
C  -3.968341 0.734847 -0.453261
H  0.912566 1.315358 -0.5476
H  2.449124 -1.187083 -1.213249
H  2.982466 0.437866 -1.799595
H  2.881229 2.031044 0.945606
H  2.330069 0.699342 2.036251
H  3.872111 -0.896562 0.843624
H  -1.420352 -1.253288 -1.681287
H  -1.619022 0.916587 2.077445
H  -3.736341 -0.416155 -2.29247
H  -3.937451 1.755719 1.474802
H  -4.974873 1.08386 -0.708001
