program: Gaussian 09
title: 000284433
version: EM64L-G09RevD.01
frameworkgroup: C1[X(C10H8INO2S)]
method: RPBEPBE
basis: SDD
operation: Freq
keyword: #p
keyword: freq=noraman
keyword: PBEPBE/SDD
title: #p freq=noraman PBEPBE/SDD
converged: NO YES NO NO
title: Mulliken charges:
elementType: I S O O N C C C C C C C C C C H H H H H H H H
charge: 0.252800 0.875422 -0.508431 -0.508422 0.016394 -0.106880 0.444735 -0.234369 -0.234438 -0.363083 -0.362663 -0.318421 -0.796540 -0.173890 -0.073566 0.291013 0.291015 0.248172 0.248164 0.301800 0.231918 0.231885 0.247384
chargesum: 0.00000
title: Mulliken charges with hydrogens summed into heavy atoms:
elementType: I S O O N C C C C C C C C C C
charge: 0.252800 0.875422 -0.508431 -0.508422 0.016394 -0.106880 0.444735 0.056644 0.056576 -0.114911 -0.114499 -0.016621 -0.085352 -0.173890 -0.073566
polarizability: 2.62028159e+02 3.52949653e+00 1.44710234e+02 1.49723649e-02 -6.22657793e-03 1.22292033e+02
1716.lowfreq: -40.9575 -9.5008 -0.0020 -0.0017 -0.0014 1.8296 5.3180 11.6496 37.8522
frequency: -40.5981 11.2390 37.8354 40.1328 78.3689 81.9036 115.1418 132.9388 139.7010 216.7420 221.4449 239.5452 289.4809 302.0949 352.3907 362.4550 385.8550 396.2697 408.2358 457.1818 495.9809 531.3140 539.0834 587.5225 620.6923 678.5837 709.1668 753.8527 774.0756 795.2773 829.5753 851.6620 927.7328 962.8175 981.4055 992.2902 993.6123 1012.6594 1049.1331 1053.0567 1118.7407 1179.9156 1184.7369 1217.9133 1296.3162 1381.4486 1389.5882 1400.3734 1470.5734 1471.3681 1474.4239 1562.4688 1592.8209 1595.2509 2163.8873 2982.5044 3065.1284 3094.1360 3138.0269 3139.0673 3157.9282 3158.7450 3162.0637
redmass: 1.0222 10.1751 6.6417 4.1578 14.5508 9.8182 7.7978 7.1226 7.1839 8.6948 10.2883 10.9885 5.3496 5.5810 3.2799 11.8345 9.0033 4.0189 2.9142 7.7289 4.4903 5.2250 5.2239 6.1223 6.9552 5.7678 3.3996 1.5057 5.5490 9.3412 1.3869 1.2409 15.9832 1.2998 1.3876 1.3965 5.4965 7.7813 1.6031 2.4966 1.2875 1.1915 1.1535 3.0122 1.2628 6.7994 2.8404 1.2156 1.1013 2.3229 1.0647 9.8010 5.9604 6.9600 12.6292 1.0390 1.0948 1.1001 1.0886 1.0889 1.0948 1.0960 1.0974
irintensity: 0.6153 1.5290 0.8110 0.1569 1.0487 4.9874 3.9642 0.3138 0.5500 14.2022 0.0953 1.4456 0.3193 9.6885 0.2191 20.3146 15.5599 0.0082 0.0010 106.3622 60.0698 32.4261 13.2505 46.5291 0.2069 10.3812 1.5765 27.9108 9.9561 57.2463 34.9995 1.0953 76.6492 1.5043 0.0261 1.8040 8.0016 104.0960 23.2720 34.3539 8.3218 26.4249 6.1612 8.4051 2.6758 0.4879 10.8092 17.5245 17.7595 24.7587 14.1191 87.2165 8.5554 0.0349 8.3036 21.3892 17.0706 14.0285 12.3065 4.3643 16.9152 0.7086 11.2232
temp: 298.150 k
press: 1.00000 atm
elementType: 53 16 8 8 7 6 6 6 6 6 6 6 6 6 6 1 1 1 1 1 1 1 1
symmnumber: 1
zpe: 399587.9 jmol-1
zpe.correction: 0.152195 hartree
zpe.thermalcorrener: 0.167572 hartree
zpe.thermalcorrenthalpy: 0.168516 hartree
zpe.thermalcorrgfe: 0.105543 hartree
zpe.sumelectzpe: -999.330457 hartree
zpe.sumelectthermal: -999.315080 hartree
zpe.sumelectthermalent: -999.314136 hartree
zpe.sumelectthermalfe: -999.377109 hartree
dipole: 6.1738 1.6114 -0.0002
dipole: 6.3806
quadrupole: -78.0900 -128.0464 -109.2376
quadrupole: 13.6149 -0.0052 0.0066
quadrupole: 27.0347 -22.9218 -4.1129 13.6149 -0.0052 0.0066
hfenergy: -999.4826524 hartree
pointgroup: C01 [X(C10H8I1N1O2S1)]
dipole: -2.2996558 -1.00666 -0.0001578 debye
dipolederiv: -0.1639781 -0.1561 0.0001073 -0.3906946 -0.1463281 0.0002106 0.000244 0.0001596 0.140896 2.3679921 0.0771405 0.0003996 -0.4047778 1.181144 -0.0000359 0.0010583 -0.0001369 1.0724704 -0.7679245 -0.0033915 0.0140098 0.1115548 -0.5095077 0.0313946 0.0047155 0.1320578 -0.5570264 -0.7678588 -0.0032304 -0.014137 0.111643 -0.5097384 -0.0314489 -0.005117 -0.1320054 -0.5569564 -0.197202 0.0224876 -0.0002085 0.1023655 -0.2030315 0.0005148 -0.0002658 0.0000556 -0.2128944 -0.0787008 0.0092269 -0.0001132 0.0272071 -0.2113424 -0.0000261 0.0001583 0.0000876 -0.1176636 0.5511251 0.1885579 0.0002038 0.1327872 0.0337398 0.0000808 0.0003211 -0.0001809 0.0121785 -0.1866404 0.0047231 0.0837837 -0.0273861 -0.0760312 0.0669382 -0.2664325 -0.0777531 -0.0227425 -0.1869685 0.0043219 -0.0838418 -0.0271173 -0.0761244 -0.0668594 0.2658968 0.0774596 -0.0225456 -0.2227334 -0.0197159 -0.1254346 -0.0048548 -0.1427453 -0.0407581 -0.1186887 -0.037735 0.0654024 -0.2229221 -0.0195986 0.1253062 -0.0048415 -0.1427778 0.0410107 0.1183084 0.0379032 0.0656288 -0.8646109 -0.2051993 0.0000498 -0.1915581 -0.2941582 -0.0001254 -0.0000634 -0.0000049 -0.3073429 -0.2569445 -0.0901058 -0.000243 0.0369405 0.0651379 -0.0000195 -0.0010648 -0.000318 0.0764802 0.7041904 0.4209162 -0.0002012 0.9888091 0.5220035 -0.0003343 -0.000813 -0.0002604 -0.042255 -0.0855165 -0.0947693 0.0001674 -0.2735439 -0.0587974 -0.0003601 0.0005266 -0.0000486 0.1144453 0.1496945 -0.0239757 -0.060651 -0.0144665 0.1365196 -0.0335848 -0.0549955 -0.0072571 0.0690168 0.1495047 -0.0240073 0.0607843 -0.0144536 0.1365414 0.0335099 0.0552833 0.0073755 0.0690059 0.0023296 -0.053708 0.0791286 -0.0708527 0.1262847 0.0340989 0.0800037 0.0254514 -0.0279154 0.0026176 -0.0535569 -0.0790613 -0.0708075 0.1263049 -0.0343349 -0.0796135 -0.0252608 -0.0280521 0.0106642 0.0008261 -0.0000328 0.061834 0.0063638 0.0001882 -0.0001177 0.0001965 0.200758 0.0688243 -0.0176174 0.0125075 -0.082433 0.029429 -0.077022 -0.0534178 -0.1239052 -0.0545159 0.0688434 -0.0178591 -0.0122071 -0.0822617 0.0304339 0.0764776 0.0544249 0.1235555 -0.0555376 -0.0737853 0.0546349 -0.0003163 0.0869078 -0.02332 0.000485 -0.000351 0.000564 0.1191651 unknown
polarizability: 258.0569761|21.507628|148.6814164|0.0114932|-0.0061893|122.2920332 unknown
InChI: InChI=1S/C10H8INO2S/c1-8-2-4-10(5-3-8)15(13,14)7-9(11)6-12/h2-5,7H,1H3
charge 0 multiplicity 1
23 atoms
I  4.299602 1.404831 0.00019
S  0.634423 1.227785 -0.000283
O  0.845278 1.991269 -1.429143
O  0.84402 1.993192 1.427741
N  4.405526 -2.616621 0.002564
C  -1.092244 0.453269 -0.000531
C  -3.671036 -0.628786 -0.000922
C  -1.70617 0.207711 1.23746
C  -1.705227 0.206346 -1.238729
C  -3.006973 -0.34361 1.222563
C  -3.006034 -0.344929 -1.224224
C  1.716704 -0.347207 0.001343
C  -5.081382 -1.188611 -0.001212
C  3.071441 -0.352558 0.001638
C  3.795706 -1.58615 0.00281
H  -1.196126 0.460321 2.173102
H  -1.194446 0.45791 -2.17425
H  -3.513605 -0.54894 2.172242
H  -3.511943 -0.551298 -2.174067
H  1.101186 -1.253912 0.002039
H  -5.273372 -1.809088 -0.893542
H  -5.275591 -1.804511 0.89379
H  -5.827136 -0.370212 -0.00428
