program: Gaussian 09
title: 000284425
version: EM64L-G09RevD.01
frameworkgroup: C1[X(C14H14O2S)]
method: RPBEPBE
basis: SDD
operation: Freq
keyword: #p
keyword: freq=noraman
keyword: PBEPBE/SDD
title: #p freq=noraman PBEPBE/SDD
converged: YES YES NO NO
title: Mulliken charges:
elementType: S O O C C C C C C C C C C C C C C H H H H H H H H H H H H H H
charge: 0.881326 -0.548421 -0.553422 -0.457984 0.524912 -0.713454 -0.057606 -0.349304 -0.356001 -0.257482 -0.268586 -0.227478 -0.230425 -0.213025 -0.206355 -0.230020 -0.218462 0.281543 0.239862 0.261258 0.241994 0.235576 0.237157 0.291047 0.284947 0.230252 0.228816 0.240411 0.240221 0.231897 0.236805
chargesum: 0.00000
title: Mulliken charges with hydrogens summed into heavy atoms:
elementType: S O O C C C C C C C C C C C C C C
charge: 0.881326 -0.548421 -0.553422 -0.176441 0.524912 0.029661 -0.057606 -0.113729 -0.118845 0.033565 0.016360 0.002774 -0.001609 0.027386 0.033867 0.001877 0.018344
polarizability: 2.88246352e+02 4.32089973e+00 1.75074640e+02 1.30405350e+01 -8.37721871e+00 1.08058555e+02
1716.lowfreq: -7.5360 -0.0004 0.0012 0.0015 4.8612 9.8717 17.5833 38.3128 46.9217
frequency: 16.3986 38.2916 46.9128 55.3752 81.2393 135.8013 171.0092 175.9018 180.9614 206.9500 230.7510 240.7208 249.8435 329.3199 352.4749 387.5439 401.6409 405.2430 426.7733 453.5110 507.3890 533.1759 578.1961 603.4736 614.9523 656.1637 693.1871 694.9660 759.4588 768.9476 776.1025 792.3285 845.6309 855.9522 908.1056 925.0540 935.2070 972.4350 977.7558 979.8536 984.1572 990.2883 999.5159 1005.0865 1008.3137 1020.8677 1041.2565 1048.7469 1062.6042 1075.6794 1109.2557 1149.0871 1172.6556 1176.2027 1176.7041 1195.8841 1220.5348 1301.1373 1314.6461 1350.8000 1383.0762 1389.9597 1395.1989 1434.3443 1444.4800 1451.8909 1460.8819 1480.6242 1489.4963 1578.3042 1588.0786 1601.6944 1610.6846 2985.1064 3063.4925 3077.0413 3094.6111 3128.9475 3134.4126 3136.4276 3143.2870 3147.9092 3151.7426 3159.5812 3160.7023 3170.7521 3171.8351
redmass: 5.1016 4.3102 4.5548 4.4849 5.9657 5.0682 3.5866 5.1319 5.1982 2.0724 2.2814 4.1168 3.8918 5.6160 4.8993 6.4912 2.7768 2.8399 7.4741 4.0494 4.6549 3.3480 3.8102 6.4720 6.3617 6.9495 1.6831 2.3952 1.4507 2.5465 3.1232 6.3728 1.2551 1.2437 7.9520 1.4224 1.3578 1.5941 1.4813 4.5813 1.3867 4.6764 1.3557 1.3414 4.2102 2.2286 1.4890 2.1129 2.3942 1.5550 1.7102 1.2892 1.0567 1.0569 1.1243 1.1131 1.6828 1.3047 1.6939 1.5377 8.4942 2.7111 1.6626 2.2213 2.1603 2.0342 1.0536 1.3919 1.5128 5.8279 5.8056 6.8903 5.9352 1.0363 1.0890 1.0975 1.0992 1.0850 1.0855 1.0883 1.0881 1.0928 1.0925 1.0961 1.0968 1.1011 1.1016
irintensity: 0.9731 0.5143 0.7238 1.1928 3.6373 1.5093 1.3862 0.3758 15.0166 1.1300 4.2002 7.1821 4.9469 5.5433 4.5372 10.5727 0.1713 0.0771 54.6359 1.9378 93.9293 5.7614 4.4226 0.0135 0.0767 4.6199 41.7168 38.3323 81.7983 12.5085 0.7978 70.0455 1.2316 1.0638 58.3704 1.3593 1.4577 12.5644 0.6721 4.1165 0.0396 1.5936 0.3390 0.6785 2.7845 15.2940 10.4769 20.9664 7.6757 6.6227 14.4642 21.3682 0.0214 0.2336 9.2507 2.3139 10.7076 3.7025 15.8539 6.5181 3.0071 13.0744 16.4969 15.6710 17.3554 16.7799 8.0806 9.6615 3.4978 7.6063 0.5230 0.5615 4.0517 12.3142 4.1821 4.8499 22.1535 1.4052 0.6698 2.6735 8.6750 22.7464 0.4358 26.0604 8.2738 24.0616 33.8403
temp: 298.150 k
press: 1.00000 atm
elementType: 16 8 8 6 6 6 6 6 6 6 6 6 6 6 6 6 6 1 1 1 1 1 1 1 1 1 1 1 1 1 1
symmnumber: 1
zpe: 630449.9 jmol-1
zpe.correction: 0.240126 hartree
zpe.thermalcorrener: 0.256482 hartree
zpe.thermalcorrenthalpy: 0.257426 hartree
zpe.thermalcorrgfe: 0.194384 hartree
zpe.sumelectzpe: -1089.021293 hartree
zpe.sumelectthermal: -1089.004937 hartree
zpe.sumelectthermalent: -1089.003993 hartree
zpe.sumelectthermalfe: -1089.067034 hartree
dipole: -1.6289 -0.4768 -5.2251
dipole: 5.4939
quadrupole: -80.2389 -100.9466 -119.1629
quadrupole: -0.5441 4.4453 -1.8274
quadrupole: 19.8773 -0.8305 -19.0468 -0.5441 4.4453 -1.8274
hfenergy: -1089.2614182 hartree
pointgroup: C01 [X(C14H14O2S1)]
dipole: 0.663658 -0.2640111 2.0400308 debye
polarizability: 288.5557004|-3.8294331|174.2356543|10.9491135|11.1490106|108.5881915 unknown
InChI: InChI=1S/C14H14O2S/c1-12(13-8-4-2-5-9-13)17(15,16)14-10-6-3-7-11-14/h2-12H,1H3
charge 0 multiplicity 1
31 atoms
S  0.406388 -0.033925 -0.834686
O  -0.037049 1.465228 -1.328064
O  0.30267 -1.34537 -1.818086
C  -0.683839 -0.479643 0.906896
C  -2.105375 -0.193498 0.573248
C  -0.263208 -1.899575 1.25571
C  2.221639 0.089611 -0.282683
C  -2.588054 1.141562 0.670089
C  -2.988104 -1.21236 0.1194
C  3.029925 -1.053083 -0.402584
C  2.691031 1.333902 0.170485
C  -3.925484 1.446673 0.347046
C  -4.325902 -0.905365 -0.202575
C  4.387012 -0.942327 -0.018398
C  4.050284 1.425146 0.552414
C  -4.799737 0.423068 -0.087749
C  4.890682 0.289603 0.463341
H  -0.230982 0.293443 1.549517
H  -0.866372 -2.269156 2.105856
H  -0.416453 -2.581562 0.399878
H  0.800315 -1.946303 1.545613
H  -1.907313 1.938914 0.988698
H  -2.629836 -2.241199 0.013387
H  2.61423 -1.979269 -0.814076
H  2.026182 2.204163 0.184844
H  -4.284363 2.478538 0.424213
H  -4.997985 -1.697374 -0.550612
H  5.048129 -1.811166 -0.104106
H  4.452162 2.380436 0.906378
H  -5.839225 0.658994 -0.341554
H  5.943433 0.368894 0.755859
