program: Gaussian 09
title: 000284440
version: EM64L-G09RevD.01
frameworkgroup: C1[X(C20H16O2S)]
method: RPBEPBE
basis: SDD
operation: Freq
keyword: #p
keyword: freq=noraman
keyword: PBEPBE/SDD
title: #p freq=noraman PBEPBE/SDD
converged: YES YES NO NO
title: Mulliken charges:
elementType: S O O C C C C C C C C C C C C C C C C C C C C H H H H H H H H H H H H H H H H
charge: 0.835515 -0.537617 -0.550041 -0.179213 -0.037942 0.303524 -0.228700 0.431392 -0.256642 -0.243667 -0.382768 -0.354561 -0.205754 -0.210140 -0.396160 -0.363554 -0.219193 -0.232436 -0.219798 -0.235615 -0.243116 -0.237815 -0.239623 0.284183 0.284332 0.285135 0.256747 0.287813 0.239403 0.239478 0.238168 0.257120 0.233290 0.234905 0.235466 0.232735 0.231921 0.230562 0.232666
chargesum: 0.00000
title: Mulliken charges with hydrogens summed into heavy atoms:
elementType: S O O C C C C C C C C C C C C C C C C C C C C
charge: 0.835515 -0.537617 -0.550041 -0.179213 -0.037942 0.303524 0.055483 0.431392 0.027690 0.041468 -0.126020 -0.066748 0.033649 0.029338 -0.157992 -0.106434 0.014097 0.002469 0.015668 -0.002880 -0.011194 -0.007253 -0.006957
polarizability: 3.11613963e+02 -2.84643678e+01 2.71602967e+02 -5.85207323e+00 6.96214426e+00 1.84241189e+02
1716.lowfreq: -9.1753 0.0000 0.0007 0.0009 4.5152 5.9412 17.0090 26.0497 30.4716
frequency: 16.9378 25.8886 30.4437 33.2809 47.9781 62.7098 90.8837 105.1795 146.4155 154.6770 176.4797 194.6859 207.5321 237.3645 246.4188 257.2497 307.3913 350.7194 376.5275 400.2935 403.7130 405.3058 416.4025 461.6436 501.9046 510.8226 530.3782 566.4332 570.9396 603.4803 615.1672 616.8367 658.3584 684.9971 692.6472 697.2337 701.2546 752.1782 762.0882 771.1858 781.4130 787.0050 848.3927 853.2258 853.9773 856.7633 915.9089 921.8432 931.3337 935.0233 969.0376 978.7706 979.5927 983.4110 984.0368 986.7856 989.2034 999.0690 1001.6585 1003.8904 1009.0445 1025.0538 1028.3120 1051.4945 1076.8149 1080.6111 1088.5307 1155.3550 1172.6594 1174.1819 1175.0933 1177.7561 1192.8848 1196.3333 1235.4327 1303.3050 1317.1051 1320.5651 1367.4323 1368.3014 1383.7151 1397.7429 1429.8515 1435.4880 1442.2054 1453.4505 1473.9241 1486.3984 1573.9247 1578.7910 1582.8683 1600.5369 1603.9234 1609.2155 1670.3733 3037.4951 3125.0236 3128.7025 3132.8464 3134.9925 3138.5122 3146.1654 3146.2168 3150.7778 3155.4126 3161.7940 3163.0064 3164.3716 3173.5295 3174.5467 3175.0957
redmass: 5.1581 3.7974 5.2480 4.6805 4.3113 4.6711 5.5094 6.9873 5.7164 5.7437 5.9523 5.6172 7.4236 9.5836 8.3870 4.6888 3.9994 7.6616 9.0097 2.8487 2.8380 2.8212 7.6515 4.1516 4.6703 3.6548 6.3114 6.3736 4.5086 6.4747 6.4603 6.3095 7.0425 5.1760 2.2741 1.7255 1.6454 5.3454 1.5103 1.7734 2.7613 5.6937 1.2606 1.3878 1.4163 2.4877 6.1858 1.4258 1.5200 1.3778 1.4503 1.6460 3.5367 1.3940 1.6383 3.5731 6.1176 1.3221 1.3323 1.3422 4.1211 2.3515 2.1756 2.1409 1.5495 1.6329 1.6299 3.1449 1.0562 1.0556 1.0598 1.1234 1.1254 1.1160 2.1288 1.2984 1.3987 1.5216 2.7285 3.7923 8.3894 2.5386 2.2661 2.2499 2.1154 2.0382 2.1118 2.3412 5.6831 5.8386 5.7334 5.8456 6.9388 5.9484 9.5140 1.0865 1.0860 1.0850 1.0882 1.0856 1.0888 1.0932 1.0886 1.0940 1.0926 1.0976 1.0979 1.0967 1.1014 1.0985 1.0983
irintensity: 0.6131 0.1192 0.6858 0.2980 0.1744 0.5443 0.2399 2.1047 0.9010 1.5797 0.9225 5.9621 1.9702 3.9745 5.7359 0.1407 1.3615 0.4906 26.4155 1.4718 0.5014 0.0308 45.0058 31.0992 104.4885 11.6127 46.5831 2.9215 15.0923 0.0435 0.6188 0.7237 6.0808 10.4534 41.3504 59.9354 44.2440 1.7075 76.9559 40.8700 48.1107 50.1534 1.1607 6.2061 3.8892 13.0113 43.8149 3.4408 5.9263 0.9310 12.6010 1.1958 3.5267 0.3520 2.7104 1.4661 0.4252 0.3632 0.4411 0.7262 2.0624 4.6142 7.1772 22.7735 4.9349 7.9079 11.4189 4.7672 0.0511 0.0412 0.6275 9.3270 2.4143 5.2491 18.7598 3.4295 2.4717 3.5467 2.0431 3.5417 4.4506 5.6478 13.4595 14.4077 16.2931 14.5551 2.7736 12.7080 2.6486 5.3459 1.2447 0.3778 0.5201 0.7216 10.1058 8.0201 2.8269 0.1119 0.8291 1.0164 5.4499 17.4630 13.8124 25.2241 3.0497 29.7666 18.4142 5.4347 31.4044 6.5286 15.1011
temp: 298.150 k
press: 1.00000 atm
elementType: 16 8 8 6 6 6 6 6 6 6 6 6 6 6 6 6 6 6 6 6 6 6 6 1 1 1 1 1 1 1 1 1 1 1 1 1 1 1 1
symmnumber: 1
zpe: 780560.5 jmol-1
zpe.correction: 0.297300 hartree
zpe.thermalcorrener: 0.317646 hartree
zpe.thermalcorrenthalpy: 0.318590 hartree
zpe.thermalcorrgfe: 0.245156 hartree
zpe.sumelectzpe: -1318.469615 hartree
zpe.sumelectthermal: -1318.449269 hartree
zpe.sumelectthermalent: -1318.448325 hartree
zpe.sumelectthermalfe: -1318.521759 hartree
dipole: 0.9600 3.0843 -5.8956
dipole: 6.7225
quadrupole: -121.0260 -129.9619 -148.9088
quadrupole: -6.0950 9.8884 9.3090
quadrupole: 12.2729 3.3370 -15.6099 -6.0950 9.8884 9.3090
hfenergy: -1318.7669151 hartree
pointgroup: C01 [X(C20H16O2S1)]
dipole: -0.574056 -0.2352916 -2.571056 debye
polarizability: 285.5410184|-35.7022677|293.1048131|1.8288597|21.8168342|188.8122877 unknown
InChI: InChI=1S/C20H16O2S/c21-23(22,19-14-8-3-9-15-19)20(18-12-6-2-7-13-18)16-17-10-4-1-5-11-17/h1-16H
charge 0 multiplicity 1
39 atoms
S  1.430924 0.210967 1.707861
O  1.470313 -1.146065 2.625192
O  1.653666 1.69767 2.368492
C  -0.300088 0.265627 0.748374
C  2.743104 0.004751 0.357655
C  -0.609469 -0.982085 0.037725
C  -0.896993 1.47561 0.898737
C  -2.226047 1.93352 0.450108
C  3.323508 1.164667 -0.179912
C  3.110726 -1.299558 -0.009448
C  -0.711176 -0.974165 -1.383943
C  -0.773806 -2.210444 0.739832
C  4.32164 1.000175 -1.168353
C  4.109797 -1.443441 -1.000846
C  -2.53881 3.311152 0.64135
C  -3.216095 1.088507 -0.130547
C  -1.000663 -2.162902 -2.085049
C  -1.060772 -3.39644 0.029631
C  4.707224 -0.298513 -1.579292
C  -1.178144 -3.377723 -1.380178
C  -3.789477 3.833869 0.253959
C  -4.468089 1.611877 -0.510321
C  -4.760661 2.98499 -0.325611
H  -0.307727 2.21873 1.465559
H  3.0223 2.152815 0.183387
H  2.649006 -2.162952 0.480299
H  -0.564555 -0.033122 -1.925228
H  -0.669654 -2.222173 1.828569
H  4.800811 1.881516 -1.607485
H  4.42234 -2.445303 -1.313279
H  -1.791266 3.9691 1.100931
H  -3.010672 0.02414 -0.272863
H  -1.080636 -2.144042 -3.177518
H  -1.192011 -4.335546 0.578123
H  5.48326 -0.417869 -2.343348
H  -1.401517 -4.301431 -1.925586
H  -4.008656 4.89595 0.408438
H  -5.221443 0.948186 -0.949093
H  -5.735689 3.385654 -0.624126
