program: Gaussian 09
title: 000284403
version: EM64L-G09RevD.01
frameworkgroup: C1[X(C12H12O3S)]
method: RPBEPBE
basis: SDD
operation: Freq
keyword: #p
keyword: freq=noraman
keyword: PBEPBE/SDD
title: #p freq=noraman PBEPBE/SDD
converged: YES YES NO NO
title: Mulliken charges:
elementType: S O O O C C C C C C C C C C C C H H H H H H H H H H H H
charge: 0.895823 -0.574748 -0.531340 -0.432690 -0.098221 -0.584172 0.376308 -0.409678 0.383123 -0.275090 -0.394251 -0.290095 -0.402758 -0.398986 -0.233520 -0.229641 0.312836 0.259624 0.300263 0.285793 0.251319 0.238535 0.210699 0.250988 0.245647 0.237857 0.236163 0.370214
chargesum: 0.00000
title: Mulliken charges with hydrogens summed into heavy atoms:
elementType: S O O O C C C C C C C C C C C C
charge: 0.895823 -0.574748 -0.531340 -0.062476 -0.098221 -0.011712 0.376308 -0.109415 0.383123 0.010703 -0.142933 0.159139 -0.151770 -0.153339 0.004336 0.006522
polarizability: 2.43445016e+02 1.63634064e+01 1.64327741e+02 -3.89780678e+00 1.61897225e+01 1.01419382e+02
1716.lowfreq: -11.3270 -3.9677 -0.0025 -0.0024 -0.0004 6.9326 26.6419 33.9052 62.2258
frequency: 26.5821 33.5692 62.1363 111.5550 129.2622 183.9575 191.8082 197.0466 212.5986 247.5473 272.4806 301.3312 351.7431 378.5987 397.6009 415.0432 456.0807 481.5862 506.8395 507.4165 538.6766 580.2611 624.5062 639.6291 686.9113 750.0810 757.4928 762.3721 782.2494 814.6601 831.3463 837.0572 883.5750 899.5334 920.2256 926.2609 932.2523 966.3533 982.7784 1000.6501 1004.0816 1023.2102 1037.4111 1052.1841 1130.1416 1140.6437 1153.4745 1176.7011 1182.5502 1219.1157 1240.1557 1259.2793 1271.2191 1341.9553 1348.3700 1387.7053 1409.2650 1417.1820 1424.6784 1432.6779 1445.5338 1457.3583 1511.2409 1580.1030 1593.8861 1631.9537 2943.1106 3037.9477 3047.0129 3128.6345 3135.0137 3136.7809 3137.7309 3139.8147 3150.4687 3161.5200 3168.4781 3305.6776
redmass: 6.2587 5.0097 4.0123 7.8867 3.8755 3.7584 4.0252 8.1699 9.4627 3.5192 6.3523 6.5709 4.2351 7.3505 3.0623 4.7819 3.0765 2.5538 3.5750 6.6658 5.3528 6.2026 6.4008 3.4494 1.1056 5.6051 3.3111 1.6371 2.6138 5.7441 1.4044 2.1821 1.4964 3.5236 3.4073 3.2852 1.6548 1.3588 1.4102 1.3546 1.9733 2.3850 3.0451 2.2787 1.6845 1.2441 1.2274 1.0792 1.1335 1.8839 1.4801 1.2305 1.8068 1.8428 1.2428 1.1025 4.7234 1.1753 5.9851 2.2500 2.4143 1.0796 3.7828 6.5897 6.6720 6.6837 1.0685 1.0698 1.0789 1.0865 1.0891 1.0887 1.1096 1.0917 1.0954 1.0970 1.1005 1.0665
irintensity: 1.2481 0.8086 4.8067 1.6686 1.1300 1.4375 9.0216 5.6715 7.0146 2.9696 7.1402 11.1768 15.4187 46.7430 1.2893 1.1773 9.4797 28.8013 3.9881 0.1136 23.1119 25.0670 5.5871 10.3348 132.3966 20.5328 13.3580 75.0418 2.9854 0.8979 48.8728 13.9327 22.3698 57.2370 44.5887 58.0638 8.0393 2.2225 6.9749 0.0224 47.5503 8.7697 72.2387 29.0416 11.6086 3.2584 1.0958 1.5340 33.3556 6.9653 0.8176 7.4991 8.2690 9.5338 2.6191 11.4792 6.1925 113.9076 0.9885 1.5000 0.4252 7.4387 13.6036 5.0283 2.5888 0.9728 54.1874 9.3095 13.1179 1.5910 0.2224 5.4518 1.1331 5.2595 21.7101 6.5070 28.7801 124.6972
temp: 298.150 k
press: 1.00000 atm
elementType: 16 8 8 8 6 6 6 6 6 6 6 6 6 6 6 6 1 1 1 1 1 1 1 1 1 1 1 1
symmnumber: 1
zpe: 555940.1 jmol-1
zpe.correction: 0.211746 hartree
zpe.thermalcorrener: 0.226487 hartree
zpe.thermalcorrenthalpy: 0.227431 hartree
zpe.thermalcorrgfe: 0.168814 hartree
zpe.sumelectzpe: -1086.890566 hartree
zpe.sumelectthermal: -1086.875826 hartree
zpe.sumelectthermalent: -1086.874881 hartree
zpe.sumelectthermalfe: -1086.933499 hartree
dipole: -6.2015 0.2979 4.3774
dipole: 7.5966
quadrupole: -101.4842 -104.8123 -104.8792
quadrupole: 4.4530 9.2584 8.2521
quadrupole: 2.2410 -1.0871 -1.1540 4.4530 9.2584 8.2521
hfenergy: -1087.102312 hartree
pointgroup: C01 [X(C12H12O3S1)]
dipole: -2.3977914 0.3761928 1.7440433 debye
polarizability: 240.9825879|18.7668101|169.9334633|-12.8928313|-0.1998585|98.2760874 unknown
InChI: InChI=1S/C12H12O3S/c13-7-8-16(14,15)12-6-5-10-3-1-2-4-11(10)9-12/h1-6,9,13H,7-8H2
charge 0 multiplicity 1
28 atoms
S  2.446671 0.635373 -0.728466
O  2.766171 -0.824669 -1.444894
O  2.81194 2.056226 -1.44658
O  4.200154 -1.754453 0.750843
C  0.599124 0.63131 -0.328391
C  3.369713 0.573125 0.989595
C  -1.478611 -0.593025 -0.08818
C  -0.070552 -0.582568 -0.360901
C  -2.148841 0.661462 0.20281
C  -0.024136 1.883816 -0.073669
C  -1.394216 1.883521 0.194493
C  3.362143 -0.860562 1.533058
C  -2.238469 -1.808676 -0.100769
C  -3.556504 0.645686 0.474154
C  -3.608693 -1.789674 0.167851
C  -4.27143 -0.55415 0.458354
H  4.381144 0.9187 0.720634
H  2.836913 1.310174 1.613197
H  0.463337 -1.503904 -0.621857
H  0.557241 2.809876 -0.126578
H  -1.912223 2.82882 0.39207
H  3.800601 -0.840394 2.547536
H  2.318941 -1.236394 1.62801
H  -1.728779 -2.752298 -0.326172
H  -4.066482 1.591264 0.692023
H  -4.184136 -2.72127 0.156217
H  -5.346742 -0.555576 0.666254
H  3.861115 -1.721539 -0.195142
