program: Gaussian 09
title: 000284406
version: EM64L-G09RevD.01
frameworkgroup: C1[X(C14H12ClFO2S)]
method: RPBEPBE
basis: SDD
operation: Freq
keyword: #p
keyword: freq=noraman
keyword: PBEPBE/SDD
title: #p freq=noraman PBEPBE/SDD
converged: YES YES NO NO
title: Mulliken charges:
elementType: Cl S F O O C C C C C C C C C C C C C C H H H H H H H H H H H H
charge: -0.050802 0.894550 -0.193364 -0.541000 -0.544718 -0.569651 -0.594467 -0.100739 0.622782 -0.160491 -0.215669 -0.417134 -0.356503 -0.355703 -0.347484 -0.228153 -0.224951 0.337289 -0.237264 0.282701 0.324824 0.329225 0.299665 0.298135 0.255967 0.242461 0.270581 0.271089 0.238562 0.233063 0.237200
chargesum: 0.00000
title: Mulliken charges with hydrogens summed into heavy atoms:
elementType: Cl S F O O C C C C C C C C C C C C C C
charge: -0.050802 0.894550 -0.193364 -0.541000 -0.544718 0.037874 -0.265242 -0.100739 0.622782 0.139174 0.082466 -0.161167 -0.114042 -0.085122 -0.076394 0.010409 0.008112 0.337289 -0.000064
polarizability: 2.05136905e+02 2.33614002e+01 1.99869230e+02 -1.08494104e+01 1.77012195e+01 1.51664072e+02
1716.lowfreq: -12.6561 -0.0025 -0.0024 -0.0021 4.4183 10.6700 18.6377 27.9461 44.6179
frequency: 16.9996 27.8633 44.5024 52.3916 62.0967 102.5334 117.6671 139.2931 141.9917 180.8229 206.4499 213.5627 225.3209 274.5483 299.6243 316.6552 383.1446 398.0936 400.4611 411.6295 414.4280 435.8764 501.4766 508.7532 547.9660 552.0739 585.2831 612.9079 614.3578 650.3530 700.1698 706.2377 759.1801 777.5852 782.9572 790.5304 819.2896 842.0416 851.2911 917.8637 923.7761 932.2828 951.0316 967.0404 978.9146 990.4890 993.3809 1001.5874 1022.7357 1041.9209 1058.4515 1077.4620 1102.4422 1120.8551 1153.1845 1160.1719 1175.9574 1192.5399 1196.0612 1209.6600 1233.9703 1279.3906 1313.2114 1362.5254 1392.1690 1393.1291 1393.5586 1422.1629 1447.4421 1464.4505 1485.4201 1586.9054 1592.4785 1606.8095 1610.8145 3062.2339 3098.0508 3126.7091 3133.2065 3143.7875 3154.8679 3155.9041 3158.7425 3163.0796 3169.2009 3183.0206 3185.4675
redmass: 5.7541 9.1533 4.7363 4.0919 7.2157 7.4251 8.7545 9.9322 8.5470 8.5279 7.2209 4.6071 5.9796 5.1678 9.3917 9.2968 9.5072 4.4665 3.1169 4.3062 4.0139 4.9092 3.5120 3.5164 5.3911 4.0918 7.7667 6.2699 7.1795 4.8879 1.6568 3.7782 3.4517 8.0703 2.1368 6.9734 1.2503 1.5386 1.2577 1.8153 8.3529 1.5391 1.3435 1.3578 1.4299 5.3929 4.8977 1.3334 2.4878 2.3884 2.4892 1.4541 1.2783 1.3298 1.3194 1.1514 1.0582 1.1189 2.7314 1.4291 1.6285 1.2438 1.5015 1.7567 11.4030 3.2246 3.6855 1.1157 2.0737 2.3698 2.3220 6.2392 5.9336 8.2415 6.0081 1.0564 1.0873 1.0864 1.0874 1.0921 1.0966 1.0903 1.1105 1.0900 1.1016 1.0961 1.0972
irintensity: 0.1988 0.3293 0.0571 0.4985 0.5397 9.1931 6.6353 3.0115 0.2734 0.2496 0.6945 5.4292 2.1281 3.8305 6.2845 1.7075 27.1243 7.7412 0.8748 47.6786 47.2637 7.4025 22.2713 33.8608 17.5995 2.3417 8.7050 3.9353 0.2140 65.4722 77.3446 2.2850 1.2254 45.4765 18.6027 53.2601 2.1326 71.2398 1.8047 49.4232 71.1539 8.7818 0.0292 0.0687 0.0827 0.6365 4.9958 0.0436 3.5000 19.9229 11.9612 2.3307 5.4725 10.7160 56.8398 0.8587 0.4772 2.2307 61.1126 5.6896 23.0939 4.4502 9.7973 5.4345 2.0600 6.2996 2.3102 11.6527 16.1537 75.0511 2.6690 48.3222 0.4388 7.2894 1.9658 3.8030 1.0588 2.6684 0.2041 11.1212 20.0170 2.7285 0.7404 1.9856 14.0760 0.6466 5.1446
temp: 298.150 k
press: 1.00000 atm
elementType: 17 16 9 8 8 6 6 6 6 6 6 6 6 6 6 6 6 6 6 1 1 1 1 1 1 1 1 1 1 1 1
symmnumber: 1
zpe: 585900.6 jmol-1
zpe.correction: 0.223158 hartree
zpe.thermalcorrener: 0.241275 hartree
zpe.thermalcorrenthalpy: 0.242219 hartree
zpe.thermalcorrgfe: 0.174398 hartree
zpe.sumelectzpe: -1647.573545 hartree
zpe.sumelectthermal: -1647.555428 hartree
zpe.sumelectthermalent: -1647.554484 hartree
zpe.sumelectthermalfe: -1647.622304 hartree
dipole: 1.2371 4.4257 -2.0776
dipole: 5.0432
quadrupole: -135.4583 -130.3917 -123.9377
quadrupole: -1.3749 -5.4439 11.9222
quadrupole: -5.5291 -0.4624 5.9915 -1.3749 -5.4439 11.9222
hfenergy: -1647.7967029 hartree
pointgroup: C01 [X(C14H12Cl1F1O2S1)]
dipole: -0.3921695 1.9186854 -0.3188578 debye
polarizability: 185.2916296|18.2441793|210.045685|-12.353666|27.6860903|161.3328922 unknown
InChI: InChI=1S/C14H12ClFO2S/c15-14(11-4-2-1-3-5-11)10-19(17,18)13-8-6-12(16)7-9-13/h1-9,14H,10H2
charge 0 multiplicity 1
31 atoms
Cl -3.384673 -2.146038 -2.004911
S  0.709011 -2.012761 0.031697
F  3.323661 3.417861 0.349032
O  1.846932 -3.000861 -0.606351
O  -0.002985 -2.318306 1.475667
C  -0.73717 -1.951791 -1.327252
C  -2.067064 -1.677407 -0.648818
C  1.486017 -0.288064 0.114548
C  -2.312818 -0.271447 -0.167648
C  0.962818 0.652873 1.017073
C  2.611538 -0.055079 -0.695228
C  -2.739096 -0.065214 1.168982
C  -2.120271 0.850597 -1.015393
C  1.590105 1.914976 1.097624
C  3.23712 1.208647 -0.618084
C  -2.95634 1.243062 1.656211
C  -2.34192 2.156127 -0.530848
C  2.703535 2.159701 0.272115
C  -2.757526 2.356633 0.807757
H  -0.412288 -1.186317 -2.047134
H  -0.662543 -2.96605 -1.748822
H  -2.255259 -2.417046 0.143556
H  0.10465 0.406006 1.649027
H  3.002113 -0.850205 -1.338761
H  -2.884815 -0.928454 1.82772
H  -1.825497 0.702586 -2.060817
H  1.229196 2.69014 1.778618
H  4.117205 1.451544 -1.2195
H  -3.284093 1.391398 2.690775
H  -2.197927 3.016181 -1.193648
H  -2.933417 3.371305 1.181715
