program: Gaussian 09
title: 000284394
version: EM64L-G09RevD.01
frameworkgroup: C1[X(C14H13NO)]
method: RPBEPBE
basis: SDD
operation: Freq
keyword: #p
keyword: freq=noraman
keyword: PBEPBE/SDD
title: #p freq=noraman PBEPBE/SDD
converged: YES YES NO NO
title: Mulliken charges:
elementType: O N C C C C C C C C C C C C C C H H H H H H H H H H H H H
charge: -0.337715 -0.064382 0.292464 0.308237 -0.354820 -0.387917 0.427868 -0.315057 -0.797717 -0.236889 -0.228841 -0.369941 -0.395807 -0.237266 -0.223473 -0.235087 0.260207 0.237572 0.256733 0.233652 0.277584 0.211777 0.234326 0.231259 0.220802 0.307415 0.227461 0.227982 0.229573
chargesum: 0.00000
title: Mulliken charges with hydrogens summed into heavy atoms:
elementType: O N C C C C C C C C C C C C C C
charge: -0.337715 -0.064382 0.292464 0.308237 -0.094613 -0.150345 0.427868 -0.058324 -0.074703 -0.002563 0.002418 -0.149139 -0.088392 -0.009804 0.004509 -0.005514
polarizability: 2.87596921e+02 2.79550481e-01 1.51365709e+02 -2.87746051e+00 -8.34483318e+00 9.39611916e+01
1716.lowfreq: -6.6502 -3.3488 -0.0004 -0.0002 0.0005 4.5526 35.2548 48.0237 74.9911
frequency: 35.2181 47.9566 74.9883 102.7917 115.9413 162.4976 188.5216 201.1743 254.4908 301.7170 331.6410 373.9942 392.4596 408.6555 453.0895 490.7260 520.8668 548.9283 587.9411 615.1273 640.9464 661.4083 697.2248 718.7579 760.6303 764.7243 773.6643 822.8640 835.1232 856.5164 865.1383 872.4241 932.7159 945.4691 982.7397 983.4683 986.8272 992.1831 1005.2750 1024.3153 1040.8132 1048.1409 1054.0322 1086.8657 1114.2585 1170.8492 1172.5477 1175.2758 1187.9261 1218.8117 1244.1604 1282.6749 1324.0471 1373.2791 1379.1136 1394.9684 1403.2365 1428.4615 1433.7912 1455.0623 1468.7774 1477.0809 1481.9265 1542.4419 1571.6300 1589.0158 1607.0271 1611.2241 2990.5406 3073.9327 3099.3499 3115.0292 3128.2862 3129.3394 3138.8855 3143.3367 3150.1894 3156.3027 3161.6761 3168.4848 3187.9351
redmass: 4.6041 4.0001 4.7573 3.9698 1.1637 3.5748 4.0562 4.8658 3.9714 3.8657 7.6990 4.9933 3.1473 2.8689 3.2040 3.9450 3.4424 5.4521 4.7335 6.3439 5.4822 6.3286 1.7471 2.6440 1.5012 1.9670 2.8428 1.4512 4.2457 1.2672 3.1801 1.6711 1.4498 1.3791 1.3696 6.1581 1.3264 1.6409 1.3277 2.2499 2.5457 1.5708 2.6465 1.6651 1.9285 1.6348 1.1856 1.1263 1.1159 2.5908 2.8020 1.4468 1.3511 4.2368 6.3181 2.4428 1.2725 2.0804 2.3891 1.0753 2.1635 1.3113 2.0231 5.5475 5.5977 6.2592 5.9628 6.7835 1.0372 1.0959 1.1005 1.0873 1.0862 1.0873 1.0890 1.0937 1.0945 1.0903 1.0996 1.1009 1.0951
irintensity: 1.1667 0.0800 0.5871 2.2376 0.9884 1.8439 2.5245 2.8110 6.0558 0.6886 9.8061 2.4272 0.1932 0.0322 5.5068 9.8457 17.3648 0.9143 17.7991 1.1419 4.2223 5.4104 53.4418 15.5222 14.0123 54.3505 27.5763 45.0124 2.9881 1.5107 15.9878 5.3253 11.8712 0.8472 0.2850 0.0748 0.0350 2.1510 1.8462 6.5139 18.7375 4.6498 18.3458 10.7540 46.7765 24.0783 4.7664 1.3810 3.4806 4.1347 3.7830 1.9341 5.8087 24.1101 5.5629 21.0434 17.2388 2.1023 16.9144 21.0061 6.4082 17.5208 39.8051 17.7395 2.9285 1.3921 0.2083 5.2055 20.4635 19.1778 20.1489 7.1222 4.6975 0.2686 5.7109 33.1085 30.1453 10.6991 30.9289 24.9073 10.7680
temp: 298.150 k
press: 1.00000 atm
elementType: 8 7 6 6 6 6 6 6 6 6 6 6 6 6 6 6 1 1 1 1 1 1 1 1 1 1 1 1 1
symmnumber: 1
zpe: 605979.6 jmol-1
zpe.correction: 0.230805 hartree
zpe.thermalcorrener: 0.244513 hartree
zpe.thermalcorrenthalpy: 0.245457 hartree
zpe.thermalcorrgfe: 0.189436 hartree
zpe.sumelectzpe: -670.091201 hartree
zpe.sumelectthermal: -670.077494 hartree
zpe.sumelectthermalent: -670.076550 hartree
zpe.sumelectthermalfe: -670.132570 hartree
dipole: 0.8508 -2.2420 1.7850
dipole: 2.9895
quadrupole: -75.5118 -88.2759 -97.5871
quadrupole: -0.6186 1.4485 1.5488
quadrupole: 11.6131 -1.1509 -10.4622 -0.6186 1.4485 1.5488
hfenergy: -670.3220067 hartree
pointgroup: C01 [X(C14H13N1O1)]
dipole: 0.3485392 -0.8219977 0.7656177 debye
polarizability: 287.3951641|5.6460491|150.2775527|2.104736|-11.9069138|95.2511055 unknown
InChI: InChI=1S/C14H13NO/c1-12-7-5-6-10-14(12)15(16)11-13-8-3-2-4-9-13/h2-11H,1H3
charge 0 multiplicity 1
29 atoms
O  0.104363 1.424432 -1.065399
N  0.342244 0.353261 -0.297373
C  1.761767 0.023372 -0.078469
C  2.628154 1.00896 0.468626
C  2.223584 -1.251447 -0.470869
C  3.989986 0.647071 0.620389
C  -2.042096 -0.276726 0.134704
C  -0.604231 -0.424322 0.269622
C  2.130667 2.377653 0.885337
C  3.586806 -1.581414 -0.310774
C  4.471435 -0.626159 0.237312
C  -2.861638 -1.218558 0.836152
C  -2.683244 0.738844 -0.644903
C  -4.264364 -1.153425 0.763885
C  -4.091096 0.792135 -0.709892
C  -4.888391 -0.145146 -0.011907
H  1.524354 -1.96554 -0.919002
H  4.681498 1.380717 1.050681
H  -0.212685 -1.230788 0.896126
H  1.240819 2.305135 1.537564
H  1.816931 2.959338 0.001792
H  2.916156 2.9313 1.426562
H  3.951928 -2.566201 -0.620165
H  5.532181 -0.868378 0.364268
H  -2.383245 -2.001381 1.438715
H  -2.059704 1.459484 -1.177438
H  -4.873547 -1.883501 1.308241
H  -4.570884 1.5733 -1.310446
H  -5.981347 -0.092614 -0.06944
