program: Gaussian 09
title: 000284411
version: EM64L-G09RevD.01
frameworkgroup: C1[X(C15H13NO4S)]
method: RPBEPBE
basis: SDD
operation: Freq
keyword: #p
keyword: freq=noraman
keyword: PBEPBE/SDD
title: #p freq=noraman PBEPBE/SDD
converged: YES YES NO NO
title: Mulliken charges:
elementType: S O O O O N C C C C C C C C C C C C C C C H H H H H H H H H H H H H
charge: 0.902627 -0.561549 -0.512546 -0.180853 -0.200837 0.021733 -0.410752 -0.261588 -0.500150 0.468627 -0.173176 -0.434086 -0.392312 0.405104 -0.217670 -0.227114 -0.227697 -0.237156 -0.326766 -0.221858 -0.194709 0.326361 0.282345 0.268244 0.301908 0.257032 0.239711 0.322067 0.231045 0.228622 0.231460 0.290977 0.252845 0.250112
chargesum: 0.00000
title: Mulliken charges with hydrogens summed into heavy atoms:
elementType: S O O O O N C C C C C C C C C C C C C C C
charge: 0.902627 -0.561549 -0.512546 -0.180853 -0.200837 0.021733 -0.084391 0.020757 0.070002 0.468627 -0.173176 -0.177054 -0.152601 0.405104 0.104397 0.003931 0.000925 -0.005696 -0.035789 0.030987 0.055403
polarizability: 2.24868159e+02 -1.52527242e+01 2.10655555e+02 7.48346862e+00 1.30362106e+01 1.81428140e+02
1716.lowfreq: -8.1445 -3.4151 -0.0013 0.0010 0.0016 5.2199 20.8952 22.9933 29.3871
frequency: 20.3003 22.9413 29.3576 47.4796 69.2156 109.2740 113.6812 127.0346 145.3635 163.4159 181.7506 211.6454 238.0361 241.8858 271.4014 299.9031 327.2575 374.1970 388.9449 401.3142 405.5961 425.5950 474.9242 481.0468 503.1723 533.0815 560.9145 611.2685 615.7121 624.4544 662.0958 670.4818 705.7516 725.3864 737.5412 767.8666 789.6741 790.6203 793.1757 852.0889 859.7765 903.5311 907.3090 921.7228 926.0662 945.5731 981.7242 986.5600 988.8540 990.7634 993.3191 999.8430 1011.7274 1028.4288 1032.0958 1077.6855 1081.2905 1096.3432 1097.6262 1120.1132 1135.5203 1173.7535 1173.9370 1180.3245 1190.8822 1206.2385 1221.7900 1230.7957 1250.1306 1320.5372 1371.7788 1377.4791 1379.1156 1396.7886 1424.5526 1434.6988 1439.9691 1443.0862 1489.6283 1577.0946 1588.2909 1589.6092 1614.7723 3079.9274 3103.5613 3121.9632 3125.4953 3129.7939 3137.2455 3148.4106 3153.1362 3164.8850 3169.0376 3183.3350 3212.6253 3220.2993
redmass: 5.9689 5.0700 5.1998 9.2360 6.3088 5.5934 4.9307 7.5546 4.8627 6.1090 9.2958 7.0993 7.2648 7.6776 5.8896 5.6455 4.5376 9.0714 8.4575 3.9055 2.9046 4.1287 4.3175 5.2375 4.4469 6.2598 3.5755 3.8617 6.3715 6.4408 5.5583 8.6557 1.9967 3.3960 2.6258 1.8406 9.8336 8.6756 1.4745 3.2209 1.4421 1.4850 1.4077 3.2960 2.0115 2.8361 1.4064 2.1118 2.1817 3.0234 2.5391 1.3470 1.3695 2.0482 2.4547 1.2101 1.5091 1.4673 1.7481 1.3830 1.8305 1.0690 1.0593 1.8188 1.1159 1.7391 9.7657 1.3737 1.4623 1.3504 2.5749 6.4646 6.2623 9.9390 2.2900 1.9480 2.3728 1.3291 2.5217 6.3450 7.0468 6.0853 6.0599 1.0866 1.0553 1.0856 1.0878 1.0900 1.0920 1.0963 1.0890 1.1016 1.0939 1.0990 1.1098 1.0989
irintensity: 0.6462 1.3481 0.2318 1.4373 1.5179 1.9955 0.1741 2.1243 0.2721 2.9773 4.9319 0.8373 7.8213 0.4324 15.3454 2.2344 11.7438 20.7258 2.5830 3.7831 0.2039 5.3849 16.4630 30.5946 40.0343 0.6263 6.1664 21.3346 0.8511 17.6260 13.4743 19.7994 41.1791 16.9509 27.8933 24.1899 54.2217 15.4728 70.2672 3.6352 0.5323 5.6092 2.1924 57.0716 23.9758 1.4205 0.4735 7.2946 6.0192 2.3121 10.2759 2.1196 0.5313 9.2294 6.7480 12.4905 2.4804 38.5289 17.6269 6.8182 0.5864 2.7005 0.2654 13.0499 0.6038 0.3660 203.9423 3.4757 3.8870 0.2620 4.5432 55.3087 100.7142 12.6887 39.1147 18.6172 29.4450 11.5213 21.1316 11.0200 13.1178 2.1840 11.7815 1.0907 3.7180 3.9321 0.3103 13.8105 11.1300 31.8527 1.1873 24.4387 10.4973 8.5241 2.5034 3.4798
temp: 298.150 k
press: 1.00000 atm
elementType: 16 8 8 8 8 7 6 6 6 6 6 6 6 6 6 6 6 6 6 6 6 1 1 1 1 1 1 1 1 1 1 1 1 1
symmnumber: 1
zpe: 649725.9 jmol-1
zpe.correction: 0.247468 hartree
zpe.thermalcorrener: 0.266452 hartree
zpe.thermalcorrenthalpy: 0.267396 hartree
zpe.thermalcorrgfe: 0.197666 hartree
zpe.sumelectzpe: -1331.316185 hartree
zpe.sumelectthermal: -1331.297201 hartree
zpe.sumelectthermalent: -1331.296256 hartree
zpe.sumelectthermalfe: -1331.365986 hartree
dipole: -1.8917 -3.2023 5.7055
dipole: 6.8107
quadrupole: -116.2601 -134.6228 -131.0953
quadrupole: -11.9933 15.8840 -2.4363
quadrupole: 11.0660 -7.2967 -3.7692 -11.9933 15.8840 -2.4363
hfenergy: -1331.5636527 hartree
pointgroup: C01 [X(C15H13N1O4S1)]
dipole: -0.9665512 -2.08388 1.3795703 debye
polarizability: 223.078768|-19.9426165|196.1887157|3.3709533|17.6550481|197.6843708 unknown
InChI: InChI=1S/C15H13NO4S/c17-16(18)13-8-4-5-9-14(13)21(19,20)15-10-12(15)11-6-2-1-3-7-11/h1-9,12,15H,10H2
charge 0 multiplicity 1
34 atoms
S  1.236264 1.749057 0.369476
O  1.110177 2.317214 1.907421
O  2.214312 2.499759 -0.690274
O  2.623862 -1.49637 -2.638411
O  1.052332 0.050528 -2.067897
N  1.97859 -0.798853 -1.771921
C  -0.547267 1.682373 -0.271088
C  -1.58856 1.035328 0.623548
C  -1.546409 2.575165 0.443123
C  -2.671967 0.169185 0.038456
C  1.904741 -0.073966 0.658697
C  -2.458824 -0.61342 -1.123927
C  -3.93402 0.112894 0.685443
C  2.286594 -0.999724 -0.335848
C  2.175355 -0.336422 2.01012
C  -3.490815 -1.435298 -1.632402
C  -4.963337 -0.710237 0.179827
C  -4.744855 -1.487302 -0.982644
C  2.945996 -2.198715 0.02061
C  2.813172 -1.546151 2.374198
C  3.20371 -2.470843 1.37922
H  -0.535086 1.572577 -1.355049
H  -1.229776 0.729061 1.616958
H  -2.293984 3.061086 -0.190907
H  -1.191635 3.147467 1.30551
H  -1.485961 -0.582997 -1.628644
H  -4.106855 0.719222 1.582855
H  1.903664 0.426117 2.750363
H  -3.314875 -2.034188 -2.532931
H  -5.933642 -0.744619 0.687832
H  -5.544123 -2.124512 -1.377056
H  3.235058 -2.89312 -0.77332
H  3.014454 -1.753638 3.42995
H  3.707409 -3.401263 1.658917
