program: Gaussian 09
title: 000284385
version: EM64L-G09RevD.01
frameworkgroup: C1[X(C14H12ClNO2S)]
method: RPBEPBE
basis: SDD
operation: Freq
keyword: #p
keyword: freq=noraman
keyword: PBEPBE/SDD
title: #p freq=noraman PBEPBE/SDD
converged: YES YES NO NO
title: Mulliken charges:
elementType: Cl S O O N C C C C C C C C C C C C C C H H H H H H H H H H H H
charge: -0.039936 0.875231 -0.545698 -0.552752 -0.475893 -0.209787 -0.641324 -0.189005 0.530920 0.473321 -0.269299 -0.407295 -0.437836 -0.382644 -0.256051 -0.188713 -0.197411 -0.208043 -0.115792 0.303039 0.290604 0.307755 0.309720 0.279832 0.229958 0.254906 0.265874 0.242197 0.231984 0.262141 0.259996
chargesum: 0.00000
title: Mulliken charges with hydrogens summed into heavy atoms:
elementType: Cl S O O N C C C C C C C C C C C C C C
charge: -0.039936 0.875231 -0.545698 -0.552752 -0.166174 0.093252 -0.042964 -0.189005 0.530920 0.473321 0.010533 -0.177336 -0.182930 -0.116770 -0.013854 0.043272 0.064730 0.051953 -0.115792
polarizability: 3.03529044e+02 -7.68029812e+00 1.78345203e+02 1.05349484e+01 -1.00058238e+01 1.25682336e+02
1716.lowfreq: -5.7285 -3.0261 0.0011 0.0017 0.0022 4.7033 31.2206 36.9498 44.3439
frequency: 31.1403 36.9433 44.3385 85.4274 108.7487 136.9731 151.2168 175.4091 187.6692 223.9284 242.1033 256.1023 301.5871 319.3854 328.2549 381.5543 392.9421 406.9110 409.3868 427.5612 450.3047 468.2301 517.7532 534.8757 562.2284 577.9425 615.7157 629.3838 656.5475 685.7857 715.6263 725.0702 759.4182 788.6993 814.3359 837.2179 839.8963 847.4601 852.9648 885.0903 926.0554 947.7627 959.0797 974.4517 980.4421 988.6847 1000.7287 1006.8042 1033.3468 1073.2791 1099.4079 1104.9155 1133.8714 1141.1527 1172.9670 1182.9836 1207.1158 1218.0717 1253.0382 1278.6627 1294.9085 1323.8388 1341.2147 1376.5455 1385.0578 1402.7870 1407.0932 1427.3691 1475.7114 1476.4920 1493.2155 1572.5238 1586.6411 1600.2057 1618.5612 2939.1861 3061.4172 3121.3261 3135.7372 3137.7113 3143.9577 3150.6140 3159.9322 3171.3942 3174.8499 3176.7774 3555.6768
redmass: 4.4367 6.4904 7.1584 5.2542 6.5328 7.5327 9.2313 6.5794 6.3969 8.1023 5.6919 5.1114 5.3463 4.5228 4.7671 10.1271 5.0696 5.6729 3.3588 8.1536 2.3025 1.4453 2.9631 3.7759 5.4036 3.6930 5.9265 5.9880 6.5281 6.1183 3.4459 3.7363 1.2992 11.4367 3.7512 1.2559 1.7183 2.0957 2.3309 2.4234 7.3138 1.3633 1.3559 1.3759 1.3381 2.8336 4.2852 4.2447 2.1108 2.7789 1.7182 1.7505 1.4795 1.6460 1.0655 1.1126 1.8404 1.5063 1.4064 1.7379 1.5681 1.8326 1.2610 3.0633 5.1819 1.6193 1.3840 2.5907 2.1999 2.4089 2.3178 4.7906 7.2694 6.2470 7.0984 1.0830 1.0558 1.0880 1.0904 1.0899 1.0886 1.0943 1.1116 1.0953 1.0961 1.0996 1.0768
irintensity: 0.1113 1.5179 2.0887 3.3819 1.2247 0.3504 2.8475 3.8598 0.9616 8.5141 0.8325 4.7555 12.1157 2.7643 5.2144 19.0302 2.2585 33.7352 17.0449 4.5557 68.9998 64.4648 19.4835 0.7597 10.1918 14.5558 19.6686 0.5245 10.2432 7.8265 1.5319 6.3164 105.7541 66.7891 8.3579 1.4568 63.3238 16.3890 17.9810 15.9579 57.0734 1.7630 0.3175 0.2771 0.0486 21.5868 41.4618 18.2939 6.1948 50.7017 15.6703 19.1488 11.0764 8.3025 3.6868 2.8887 4.3767 8.1885 5.7283 10.9348 7.1136 17.2783 77.0610 13.1147 6.2098 12.8036 9.1105 12.4405 47.8134 100.9439 190.4671 19.9820 1.6087 14.0754 130.1364 20.3723 0.6643 8.3916 3.6188 6.1296 7.0516 7.9777 0.5322 3.0072 0.9405 19.5117 35.1497
temp: 298.150 k
press: 1.00000 atm
elementType: 17 16 8 8 7 6 6 6 6 6 6 6 6 6 6 6 6 6 6 1 1 1 1 1 1 1 1 1 1 1 1
symmnumber: 1
zpe: 596970.6 jmol-1
zpe.correction: 0.227374 hartree
zpe.thermalcorrener: 0.244267 hartree
zpe.thermalcorrenthalpy: 0.245211 hartree
zpe.thermalcorrgfe: 0.181532 hartree
zpe.sumelectzpe: -1602.497162 hartree
zpe.sumelectthermal: -1602.480269 hartree
zpe.sumelectthermalent: -1602.479325 hartree
zpe.sumelectthermalfe: -1602.543005 hartree
dipole: 2.7223 5.6661 0.0659
dipole: 6.2865
quadrupole: -136.2854 -129.0211 -129.4152
quadrupole: -21.0999 2.7660 -1.0646
quadrupole: -4.7115 2.5528 2.1587 -21.0999 2.7660 -1.0646
hfenergy: -1602.7245363 hartree
pointgroup: C01 [X(C14H12Cl1N1O2S1)]
dipole: 0.9227955 2.2947034 0.004721 debye
polarizability: 304.1981081|0.5343103|177.7785943|9.4114624|-9.5752956|125.5798808 unknown
InChI: InChI=1S/C14H12ClNO2S/c15-11-7-5-10(6-8-11)13-9-19(17,18)14-4-2-1-3-12(14)16-13/h1-8,13,16H,9H2
charge 0 multiplicity 1
31 atoms
Cl 6.368183 0.701549 -0.417182
S  -1.916842 -1.892602 -0.167393
O  -2.677619 -2.72513 -1.350796
O  -1.753669 -2.546078 1.329692
N  -0.417166 0.811789 0.483794
C  0.37387 -0.437351 0.453289
C  -0.122923 -1.365942 -0.671708
C  -2.645484 -0.167949 -0.052118
C  -1.798964 0.919842 0.303432
C  1.855715 -0.12504 0.250977
C  -4.019065 -0.02992 -0.31422
C  -2.435347 2.193155 0.430421
C  2.828873 -0.757611 1.062205
C  2.280187 0.764046 -0.77011
C  -4.618947 1.238836 -0.187481
C  -3.813608 2.340982 0.197988
C  4.206299 -0.515689 0.862886
C  3.652036 1.021905 -0.978368
C  4.596255 0.374016 -0.156541
H  0.251103 -0.99963 1.405828
H  -0.220857 -0.883598 -1.656265
H  0.444905 -2.306595 -0.722217
H  0.060895 1.62552 0.872309
H  -4.595542 -0.909475 -0.621619
H  -1.828609 3.064556 0.70613
H  2.514593 -1.443195 1.857774
H  1.537322 1.261321 -1.404071
H  -5.687253 1.368598 -0.381629
H  -4.266404 3.332418 0.308722
H  4.957631 -1.003391 1.490151
H  3.981436 1.707461 -1.764379
