program: Gaussian 09
title: 000284395
version: EM64L-G09RevD.01
frameworkgroup: C1[X(C16H14ClNO2S)]
method: RPBEPBE
basis: SDD
operation: Freq
keyword: #p
keyword: freq=noraman
keyword: PBEPBE/SDD
title: #p freq=noraman PBEPBE/SDD
converged: YES YES NO NO
title: Mulliken charges:
elementType: Cl S O O N C C C C C C C C C C C C C C C C H H H H H H H H H H H H H H
charge: -0.042471 0.861332 -0.552744 -0.540435 -0.483423 -0.474500 -0.232066 -0.189221 0.522723 0.493545 0.013956 -0.269052 -0.412247 -0.441418 -0.377248 -0.257017 -0.188622 -0.549530 -0.202209 -0.209022 -0.115628 0.318920 0.304082 0.310865 0.242238 0.278800 0.229402 0.253447 0.261049 0.241369 0.231444 0.227133 0.227197 0.260842 0.258510
chargesum: 0.00000
title: Mulliken charges with hydrogens summed into heavy atoms:
elementType: Cl S O O N C C C C C C C C C C C C C C C C
charge: -0.042471 0.861332 -0.552744 -0.540435 -0.172558 -0.155580 0.072016 -0.189221 0.522723 0.493545 0.256193 0.009749 -0.182846 -0.187971 -0.116199 -0.015647 0.042822 -0.095201 0.058633 0.049488 -0.115628
polarizability: 3.26711030e+02 -1.92147837e+01 2.11465664e+02 -6.65896884e+00 3.63070227e+00 1.52736906e+02
1716.lowfreq: -6.1390 -4.2590 -0.0024 -0.0009 -0.0007 5.4703 27.1777 36.5808 41.9962
frequency: 26.7545 36.5639 41.9883 51.5575 68.2001 97.7834 132.6639 134.9148 151.0664 179.5682 186.7317 200.8018 220.2329 246.3795 280.6610 299.3721 312.3778 322.1766 345.3426 378.8567 409.0430 414.7813 428.3025 446.7410 462.5807 490.4468 496.9294 527.9817 538.3857 583.1578 607.9269 631.2649 653.3060 672.8724 702.6690 714.8852 727.5621 758.3610 799.2302 815.2202 836.2083 839.8402 846.9221 855.8702 921.5188 936.3094 946.8454 958.6116 961.4102 973.2081 979.0772 992.0403 1000.7061 1002.1871 1024.3892 1043.8955 1072.9060 1096.4298 1100.9791 1113.7167 1135.4149 1169.8682 1172.6598 1182.8619 1208.1651 1232.0797 1254.0110 1275.5486 1295.1884 1302.2942 1320.6940 1344.7694 1377.4897 1384.4441 1401.4250 1426.8617 1436.6826 1476.4503 1477.0166 1493.0913 1572.9092 1587.0670 1599.7624 1618.2578 1641.0779 2922.9471 3077.2577 3101.7160 3120.8762 3123.5287 3135.0476 3138.7170 3144.2651 3150.6423 3171.1777 3174.5376 3176.1561 3213.2947 3555.4032
redmass: 4.5635 7.3661 6.2248 4.4953 3.3732 5.3258 8.0219 7.5145 10.5435 8.3405 2.8460 4.8921 8.0687 5.4698 5.1811 4.8237 5.0153 5.1049 4.3818 6.4473 2.7929 7.0615 5.1498 2.1616 1.6744 3.3874 4.7324 3.0221 3.8313 5.4135 4.9161 5.8731 6.7191 3.9203 2.7624 3.4214 3.4144 1.3090 12.2648 3.4421 1.2581 1.9845 1.5494 3.0237 11.8145 1.7469 1.3615 1.3187 1.3244 1.3668 1.3293 1.1996 4.1228 7.2049 3.0690 2.5345 2.7155 1.4248 2.2715 1.3933 1.6308 1.8467 1.1509 1.1163 2.5590 1.3587 1.3898 1.6547 1.5555 1.2979 1.8305 1.2700 3.0187 5.6909 2.2893 2.6749 1.2291 2.4626 2.1999 2.2765 4.6953 7.2779 6.2471 7.1061 4.3023 1.0825 1.0880 1.0601 1.0879 1.0934 1.0904 1.0896 1.0887 1.0941 1.0953 1.0961 1.0996 1.1151 1.0768
irintensity: 0.1460 0.8214 3.5983 0.4531 1.5220 1.1736 0.5206 1.0364 3.3322 2.8318 7.7505 0.5833 7.0568 1.5906 3.1820 9.6188 1.0579 1.2507 16.0617 6.6638 3.4263 17.8664 14.6407 56.7644 31.6999 51.4180 24.8762 15.8725 13.3088 15.5555 5.6015 0.9758 3.0489 1.5242 28.0252 1.3594 10.3259 105.5225 51.0592 14.0435 1.8302 54.6378 10.1610 29.8605 61.7497 2.3982 1.6043 22.7055 44.0810 0.2017 0.3129 12.6496 46.8725 0.9199 2.3226 12.8185 49.9902 12.0749 11.4997 10.6496 14.2616 6.8091 1.3821 2.4246 2.6515 2.1749 9.2901 4.4539 6.9383 3.7345 5.2927 83.8603 11.1667 3.3373 10.7324 12.5114 16.8807 126.8621 5.1043 202.6355 18.8939 1.8180 15.7611 127.3363 2.4563 17.7221 1.4640 3.7548 7.9608 6.4880 4.1595 6.7761 10.0285 6.0267 3.3469 0.8473 22.5576 12.6070 36.1618
temp: 298.150 k
press: 1.00000 atm
elementType: 17 16 8 8 7 6 6 6 6 6 6 6 6 6 6 6 6 6 6 6 6 1 1 1 1 1 1 1 1 1 1 1 1 1 1
symmnumber: 1
zpe: 680019.4 jmol-1
zpe.correction: 0.259006 hartree
zpe.thermalcorrener: 0.278552 hartree
zpe.thermalcorrenthalpy: 0.279497 hartree
zpe.thermalcorrgfe: 0.209629 hartree
zpe.sumelectzpe: -1679.749018 hartree
zpe.sumelectthermal: -1679.729472 hartree
zpe.sumelectthermalent: -1679.728528 hartree
zpe.sumelectthermalfe: -1679.798395 hartree
dipole: -2.9379 -4.6886 -1.5388
dipole: 5.7430
quadrupole: -151.1197 -134.3827 -138.5505
quadrupole: -20.7852 -7.8820 -0.7606
quadrupole: -9.7687 6.9683 2.8004 -20.7852 -7.8820 -0.7606
hfenergy: -1680.0080241 hartree
pointgroup: C01 [X(C16H14Cl1N1O2S1)]
dipole: 0.9556138 1.9634344 -0.5804316 debye
polarizability: 329.4950609|-7.0230469|208.8155913|6.0911893|-2.0484964|152.6029482 unknown
InChI: InChI=1S/C16H14ClNO2S/c1-2-14-16(11-7-9-12(17)10-8-11)18-13-5-3-4-6-15(13)21(14,19)20/h2-10,14,16,18H,1H2
charge 0 multiplicity 1
35 atoms
Cl 6.273955 1.278059 -0.238312
S  -1.974781 -1.670593 0.271612
O  -1.795948 -2.018865 1.866086
O  -2.747551 -2.718747 -0.715006
N  -0.505888 1.103508 0.438114
C  -0.09527 -1.223305 -0.385396
C  0.326302 -0.108786 0.602282
C  -2.722287 0.031128 0.059413
C  -1.883465 1.168303 0.22368
C  1.796993 0.25837 0.401962
C  0.695965 -2.476216 -0.335668
C  -4.09332 0.113961 -0.240039
C  -2.524017 2.441828 0.112806
C  2.760803 -0.105316 1.372156
C  2.218616 0.942713 -0.766979
C  -4.697023 1.38219 -0.351309
C  -3.899149 2.539477 -0.159589
C  0.853801 -3.300819 -1.404562
C  4.128127 0.19823 1.185421
C  3.578987 1.257726 -0.968226
C  4.515274 0.876436 0.014149
H  -0.314313 -0.86061 -1.403206
H  0.198471 -0.534181 1.624397
H  -0.036804 1.983052 0.656584
H  1.119223 -2.753344 0.638754
H  -4.663525 -0.809556 -0.388242
H  -1.922557 3.351058 0.235247
H  2.44708 -0.625581 2.284578
H  1.482181 1.23168 -1.525354
H  -5.763333 1.470325 -0.577483
H  -4.355607 3.532624 -0.234779
H  1.41181 -4.239034 -1.320334
H  0.421592 -3.065842 -2.384286
H  4.872638 -0.082291 1.935641
H  3.90702 1.783519 -1.86941
