program: Gaussian 09
title: 000284421
version: EM64L-G09RevD.01
frameworkgroup: C1[X(C18H19NO2S)]
method: RPBEPBE
basis: SDD
operation: Freq
keyword: #p
keyword: freq=noraman
keyword: PBEPBE/SDD
title: #p freq=noraman PBEPBE/SDD
converged: YES YES NO NO
title: Mulliken charges:
elementType: S O O N C C C C C C C C C C C C C C C C C C H H H H H H H H H H H H H H H H H H H
charge: 0.935714 -0.538937 -0.537654 -0.276721 -0.441655 -0.258583 -0.481826 0.460380 -0.501610 0.136514 -0.405621 -0.407167 -0.426525 -0.527675 0.403600 -0.286641 -0.223671 -0.232292 -0.394475 -0.237483 -0.249151 -0.238929 0.297537 0.310046 0.259944 0.280913 0.279794 0.242016 0.210624 0.248776 0.241406 0.254348 0.236933 0.222741 0.254030 0.228760 0.230059 0.234799 0.231100 0.235136 0.231445
chargesum: 0.00000
title: Mulliken charges with hydrogens summed into heavy atoms:
elementType: S O O N C C C C C C C C C C C C C C C C C C
charge: 0.935714 -0.538937 -0.537654 -0.276721 -0.144117 0.051463 0.059031 0.460380 0.020200 0.136514 0.053780 -0.165761 -0.172177 -0.068001 0.403600 -0.032611 0.005088 -0.002234 -0.159676 -0.006383 -0.014015 -0.007484
polarizability: 2.95616166e+02 1.50062184e+01 2.60182011e+02 1.98031596e+01 -2.47713209e+00 1.78456843e+02
1716.lowfreq: -10.0381 -5.6735 -0.0006 -0.0003 0.0007 2.2413 10.8184 26.2677 28.3848
frequency: 9.0870 26.1743 28.3038 41.4916 55.3607 74.9977 107.9090 114.6677 130.7199 150.1669 171.7900 188.2839 197.5174 215.3237 258.2072 302.5431 310.7313 344.5035 369.8836 374.9566 404.3020 416.2528 430.0529 456.6374 473.3249 475.0041 490.2148 536.6189 560.6656 571.0316 603.8915 616.0304 626.8857 706.0012 712.2409 720.5720 733.7286 771.2713 774.3945 790.7123 801.3163 847.4368 858.4645 869.5781 877.3286 879.7298 899.0439 906.7916 921.2959 923.6778 942.6765 955.7271 982.2054 987.3851 989.2926 992.7866 999.5039 1000.8775 1028.9080 1032.8656 1068.9014 1071.1021 1078.0829 1082.9429 1085.5953 1115.7733 1117.8994 1164.0710 1170.1797 1173.4418 1178.4899 1187.7904 1193.7686 1208.6927 1211.9891 1226.8948 1235.7130 1267.0670 1272.6569 1317.4587 1329.3324 1350.1246 1369.0447 1374.3622 1378.4508 1383.6221 1432.2410 1434.6030 1442.9312 1446.3817 1450.8482 1468.6447 1472.1239 1489.5706 1565.7738 1588.9326 1605.4930 1614.8176 2957.7368 2972.0642 3002.4316 3035.4152 3046.3504 3065.9559 3071.6800 3103.0860 3116.8283 3119.9968 3124.0074 3136.1699 3138.5138 3147.5537 3154.8811 3164.3654 3170.8098 3180.8578 3211.6694
redmass: 4.3967 4.3238 4.8862 4.2933 5.1316 5.5769 4.9122 3.5802 5.0691 6.8138 3.0198 10.7151 4.6155 5.0970 4.6880 2.9890 3.6239 4.0552 3.8360 3.7229 2.8388 4.0487 2.9618 3.8794 4.0549 4.2420 5.1401 3.3241 3.6123 4.6746 3.0099 6.3828 3.0067 2.0108 4.8922 2.0940 2.6757 1.7793 1.7135 10.0814 3.9111 1.4666 1.3044 3.7700 2.1903 1.7200 2.9519 2.2416 2.6413 1.6903 2.5946 1.4157 1.4090 1.3594 2.9792 2.2998 1.3739 2.9648 1.9715 2.3594 1.8952 1.2433 2.0449 1.5227 1.2656 1.3993 1.5795 1.2148 1.1089 1.0535 2.0019 1.1169 1.5393 2.2591 1.6522 2.3280 1.3632 1.3837 1.3198 1.3460 1.4918 1.4929 1.3244 4.4969 2.8677 5.5401 1.6337 2.1676 1.3483 1.2484 1.2256 1.1575 1.8560 2.5681 6.0858 6.1311 6.2860 6.0989 1.0665 1.0646 1.0620 1.0928 1.0963 1.1037 1.0864 1.0557 1.0881 1.0868 1.0870 1.0917 1.0883 1.0962 1.0934 1.1015 1.0995 1.0924 1.1162
irintensity: 0.4632 0.4713 0.3102 1.1565 0.7293 1.5093 1.1396 0.9013 11.0400 2.9026 2.5456 6.8483 3.7311 29.4445 8.1134 5.3060 10.1961 5.4944 1.0059 17.5899 0.0947 2.4436 16.0238 10.5600 3.1799 23.5514 52.4000 4.1012 1.5940 1.6060 28.0050 0.3368 28.6651 39.5392 5.3079 16.0543 22.7753 29.1947 30.7812 78.2296 13.0583 10.7481 1.0051 5.6878 4.1388 10.5522 16.0388 45.6744 5.3679 2.9368 0.2061 0.8535 0.2317 0.6365 4.8504 6.6665 0.6969 10.2588 10.7196 3.5471 6.7754 5.2359 1.7713 1.7344 25.7875 6.3716 3.8447 6.5510 5.6521 0.1007 27.7526 0.7648 1.0336 7.8108 7.0406 4.4963 2.8900 11.1139 8.8221 0.7854 2.2678 4.8733 5.2603 0.1925 2.2566 0.1712 2.9831 12.7360 24.9708 15.6952 33.2020 8.7960 17.3968 20.5557 3.8481 1.2863 5.6643 12.5590 22.8969 14.9914 19.2095 26.3199 6.2260 34.9788 1.5461 4.7731 15.2557 6.3100 0.8226 11.7120 7.6659 34.7298 22.7049 24.7995 17.3721 0.8868 0.3415
temp: 298.150 k
press: 1.00000 atm
elementType: 16 8 8 7 6 6 6 6 6 6 6 6 6 6 6 6 6 6 6 6 6 6 1 1 1 1 1 1 1 1 1 1 1 1 1 1 1 1 1 1 1
symmnumber: 1
zpe: 852850.8 jmol-1
zpe.correction: 0.324834 hartree
zpe.thermalcorrener: 0.345217 hartree
zpe.thermalcorrenthalpy: 0.346161 hartree
zpe.thermalcorrgfe: 0.272668 hartree
zpe.sumelectzpe: -1298.794291 hartree
zpe.sumelectthermal: -1298.773908 hartree
zpe.sumelectthermalent: -1298.772964 hartree
zpe.sumelectthermalfe: -1298.846457 hartree
dipole: -1.2330 3.3907 2.2852
dipole: 4.2707
quadrupole: -112.6571 -142.7721 -137.2979
quadrupole: 8.4798 7.7424 -3.3851
quadrupole: 18.2519 -11.8631 -6.3889 8.4798 7.7424 -3.3851
hfenergy: -1299.1191247 hartree
pointgroup: C01 [X(C18H19N1O2S1)]
dipole: 0.7584768 1.3410796 -0.6703955 debye
polarizability: 287.0551851|-23.7647876|265.3109874|21.6707819|10.8279475|181.8888469 unknown
InChI: InChI=1S/C9H10N.C9H9O2S/c1-2-6-9-8(4-1)5-3-7-10-9;10-12(11)9-6-8(9)7-4-2-1-3-5-7/h1-2,4,6H,3,5,7H2;1-5,8-9H,6H2
charge 0 multiplicity 1
41 atoms
S  -1.122636 -1.754836 -0.025876
O  -1.940051 -2.968666 -0.770828
O  -1.216463 -1.578807 1.602589
N  -1.520669 0.03879 -1.109122
C  0.706593 -1.973168 -0.426217
C  1.714155 -1.395251 0.550878
C  1.515191 -2.925296 0.446103
C  2.950089 -0.694132 0.053994
C  -2.670041 -0.324076 -1.989382
C  -1.740944 1.116651 -0.204185
C  -4.052088 -0.160608 -1.327968
C  4.190724 -0.909937 0.707082
C  2.892953 0.217666 -1.030517
C  -4.226808 1.290295 -0.840646
C  -3.010201 1.771293 -0.063655
C  -0.615386 1.598529 0.527734
C  5.352357 -0.227109 0.284332
C  4.055582 0.899732 -1.45586
C  -3.09672 2.899358 0.78368
C  5.288181 0.680851 -0.799089
C  -0.730781 2.708245 1.378794
C  -1.979236 3.368079 1.506978
H  0.844595 -1.933368 -1.509259
H  1.265732 -0.984279 1.467867
H  2.268223 -3.530201 -0.068111
H  1.011322 -3.409972 1.287612
H  -2.520959 -1.367269 -2.322302
H  -2.57826 0.331723 -2.880158
H  -4.844558 -0.426646 -2.051153
H  -4.128684 -0.86874 -0.481387
H  4.241215 -1.615534 1.544957
H  1.937383 0.392506 -1.540357
H  -5.132528 1.389342 -0.214095
H  -4.380754 1.955115 -1.717066
H  0.348449 1.096293 0.399627
H  6.305284 -0.402712 0.796114
H  3.999094 1.6011 -2.295862
H  -4.062856 3.409428 0.886826
H  6.189633 1.209426 -1.128535
H  0.142697 3.06485 1.934578
H  -2.078032 4.237031 2.166586
