program: Gaussian 09
title: 000284384
version: EM64L-G09RevD.01
frameworkgroup: C1[X(C17H18O3S)]
method: RPBEPBE
basis: SDD
operation: Freq
keyword: #p
keyword: freq=noraman
keyword: PBEPBE/SDD
title: #p freq=noraman PBEPBE/SDD
converged: YES YES NO NO
title: Mulliken charges:
elementType: S O O O C C C C C C C C C C C C C C C C C H H H H H H H H H H H H H H H H H H
charge: 1.048569 -0.420620 -0.525676 -0.504511 -0.192331 -0.385951 -0.554491 -0.141762 0.494342 -0.675637 0.440313 -0.443326 -0.371099 -0.422916 -0.380900 -0.219156 -0.246779 -0.238869 -0.223053 -0.231640 -0.237310 0.253108 0.315144 0.254468 0.261093 0.244167 0.255641 0.244391 0.246373 0.239147 0.236604 0.234443 0.265096 0.231322 0.230984 0.234619 0.228134 0.227558 0.230510
chargesum: 0.00000
title: Mulliken charges with hydrogens summed into heavy atoms:
elementType: S O O O C C C C C C C C C C C C C C C C C
charge: 1.048569 -0.420620 -0.525676 -0.504511 0.060777 -0.070807 -0.038931 0.102405 0.494342 0.070768 0.440313 -0.204179 -0.134495 -0.188473 -0.115805 0.012167 -0.015794 -0.004250 0.005082 -0.004082 -0.006801
polarizability: 2.27400201e+02 5.32611244e+00 2.27690068e+02 -8.75409409e+00 -6.89019367e+00 1.93015368e+02
1716.lowfreq: -6.3184 0.0002 0.0009 0.0019 4.6640 11.1782 22.8894 31.4675 34.8461
frequency: 22.8163 31.3216 34.1748 44.5142 61.7000 85.1678 116.0387 152.2370 158.7895 169.1200 180.6787 198.9064 221.8434 231.8201 249.8702 275.7225 295.5067 350.5895 361.0764 369.7446 401.7090 403.8423 413.0685 456.3474 479.7944 509.9708 527.6649 538.3327 605.6450 609.5351 616.9580 618.7430 666.1643 705.3518 707.5818 753.9758 772.0907 774.6313 825.2297 835.9771 847.9504 854.9240 857.2293 895.4845 925.0429 927.4275 953.8877 960.5940 978.5145 980.5728 983.7464 989.2714 990.1164 998.5957 998.9292 1008.8890 1025.7357 1027.7087 1061.7393 1077.5898 1083.3082 1092.7094 1116.6914 1172.3094 1173.7132 1174.4680 1184.9637 1190.0117 1193.1770 1202.7911 1224.5278 1237.2941 1257.5612 1292.3555 1300.7203 1327.1034 1331.0461 1345.3625 1361.6205 1384.1432 1384.5285 1391.6140 1437.4750 1443.3593 1455.8085 1460.3484 1461.5941 1481.2918 1481.7628 1592.8329 1593.0053 1610.4536 1612.0771 2993.9036 2997.6760 3009.6156 3019.6040 3048.8384 3078.0195 3086.9247 3111.4139 3115.6654 3119.8958 3120.0897 3128.6764 3136.7614 3142.0562 3148.6928 3158.1312 3166.5564 3169.2973
redmass: 4.1667 3.9794 4.9703 4.0316 5.7278 5.3331 4.5840 1.3762 5.8333 2.7610 6.3342 5.0327 6.9334 4.4854 4.6059 4.6189 3.0197 4.8038 6.3599 4.5754 2.8709 2.8214 6.0443 4.0725 4.6286 4.6421 3.6310 3.3736 5.0980 6.1037 6.4044 6.6006 5.1784 1.7958 1.6908 2.5355 1.9623 2.2933 2.9943 15.3869 3.0873 1.2460 1.2622 2.8526 1.4658 1.4853 4.2381 1.6549 1.3887 1.4077 3.3579 5.1231 6.0177 1.3622 1.3389 2.1569 2.2558 2.1614 3.2844 1.8632 1.6173 1.7202 2.4527 1.2371 1.1342 1.0642 1.1289 1.1542 1.5689 2.1142 1.2900 1.4205 1.4068 1.3959 1.4687 1.2893 1.3396 1.3464 1.3400 6.4337 6.9035 1.2063 2.1724 2.1265 1.0446 1.0557 1.0854 2.2668 2.2713 6.1172 6.0373 6.1215 6.1059 1.0370 1.0747 1.0764 1.0799 1.0870 1.1013 1.0977 1.1000 1.0874 1.0870 1.0884 1.0868 1.0904 1.0927 1.0957 1.0962 1.1014 1.0992
irintensity: 0.1126 1.4396 0.5889 0.5829 1.0832 0.2080 1.3735 0.8179 1.5974 2.4616 2.6971 2.6179 2.2778 6.4361 2.8720 15.0809 4.3869 8.5792 15.7827 24.2575 0.2183 0.0185 23.6515 8.6987 10.9795 12.7077 8.7051 9.5718 40.6924 19.6342 0.1670 27.6437 9.3735 53.0167 54.8177 19.6839 44.0400 24.0832 8.4166 117.5219 15.9102 0.1191 0.3558 11.5972 7.5242 9.2139 38.2478 10.0547 0.1330 0.8576 60.6966 0.6932 1.4366 3.2480 0.3939 39.7007 11.5148 3.8986 3.8905 11.4237 8.2102 9.3594 3.7517 9.5724 5.0226 1.0441 1.5433 0.6037 4.9880 1.3842 10.5732 12.0292 1.0539 1.3419 17.3572 5.6367 0.8711 3.0726 3.4214 0.8123 1.7874 27.4246 12.7753 11.8420 10.2996 12.4799 12.4400 22.3469 14.8304 0.1644 3.8409 5.3805 5.4763 6.0734 15.9136 11.1307 10.9308 2.5508 12.5351 6.7579 8.5443 5.9918 8.5373 4.5422 0.4432 5.9839 24.7764 29.5329 31.5378 24.3932 11.4851
temp: 298.150 k
press: 1.00000 atm
elementType: 16 8 8 8 6 6 6 6 6 6 6 6 6 6 6 6 6 6 6 6 6 1 1 1 1 1 1 1 1 1 1 1 1 1 1 1 1 1 1
symmnumber: 1
zpe: 807371.9 jmol-1
zpe.correction: 0.307512 hartree
zpe.thermalcorrener: 0.327225 hartree
zpe.thermalcorrenthalpy: 0.328169 hartree
zpe.thermalcorrgfe: 0.257512 hartree
zpe.sumelectzpe: -1280.647518 hartree
zpe.sumelectthermal: -1280.627804 hartree
zpe.sumelectthermalent: -1280.626860 hartree
zpe.sumelectthermalfe: -1280.697517 hartree
dipole: 3.2481 -6.5038 0.4609
dipole: 7.2843
quadrupole: -120.8029 -150.9986 -124.9187
quadrupole: 7.6872 1.1129 -0.0553
quadrupole: 11.4372 -18.7585 7.3213 7.6872 1.1129 -0.0553
hfenergy: -1280.9550292 hartree
pointgroup: C01 [X(C17H18O3S1)]
dipole: -1.2855701 2.4775095 0.6500104 debye
polarizability: 226.5634831|2.8021991|223.3805326|11.0390127|13.3449794|198.1616215 unknown
InChI: InChI=1S/C17H18O3S/c1-13-16(14-8-4-2-5-9-14)12-17(20-21(13,18)19)15-10-6-3-7-11-15/h2-11,13,16-17H,12H2,1H3
charge 0 multiplicity 1
39 atoms
S  0.003212 -2.96232 -0.850745
O  1.450316 -1.873415 -0.339747
O  -0.069751 -3.059303 -2.47078
O  0.169623 -4.288533 0.050685
C  -0.890892 -0.318133 -0.141492
C  -1.466064 -1.756237 -0.205328
C  0.064809 -0.013449 -1.332057
C  1.49632 -0.609405 -1.119985
C  -2.076175 0.653127 -0.080002
C  -1.984086 -2.340876 1.101111
C  2.419321 0.321679 -0.335704
C  -2.332553 1.392301 1.101952
C  -2.938822 0.827398 -1.194663
C  3.070423 1.3765 -1.024379
C  2.617536 0.179301 1.059418
C  -3.421263 2.290959 1.170081
C  -4.026817 1.724694 -1.128974
C  -4.273383 2.45889 0.054786
C  3.890956 2.288879 -0.325958
C  3.444311 1.0896 1.756515
C  4.078694 2.149526 1.069581
H  -0.314176 -0.221696 0.797858
H  -2.165775 -1.877123 -1.051867
H  -0.363051 -0.417095 -2.269439
H  0.159176 1.078988 -1.451868
H  1.94215 -0.821598 -2.110895
H  -2.360534 -3.368516 0.971634
H  -1.196368 -2.360826 1.873994
H  -2.814439 -1.707854 1.465566
H  -1.670169 1.27141 1.967855
H  -2.757243 0.271452 -2.122944
H  2.941329 1.482415 -2.109127
H  2.154199 -0.663918 1.580454
H  -3.602731 2.858678 2.089404
H  -4.681709 1.851286 -1.998162
H  -5.118253 3.154288 0.106275
H  4.389627 3.099322 -0.869228
H  3.599871 0.965899 2.83422
H  4.720879 2.852708 1.611455
