program: Gaussian 09
title: 000284391
version: EM64L-G09RevD.01
frameworkgroup: C1[X(C21H19NO2S)]
method: RPBEPBE
basis: SDD
operation: Freq
keyword: #p
keyword: freq=noraman
keyword: PBEPBE/SDD
title: #p freq=noraman PBEPBE/SDD
converged: YES YES NO NO
title: Mulliken charges:
elementType: S O O N C C C C C C C C C C C C C C C C C C C C C H H H H H H H H H H H H H H H H H H H
charge: 0.858268 -0.542346 -0.551113 -0.476817 -0.619009 -0.233442 -0.184980 0.576554 0.522225 0.481571 -0.272602 -0.413933 -0.417714 -0.357284 -0.412834 -0.389335 -0.259918 -0.188717 -0.363800 -0.415516 -0.222422 -0.243481 0.437668 -0.235116 -0.805265 0.311590 0.302019 0.312322 0.279351 0.228350 0.227587 0.268146 0.232650 0.249983 0.239551 0.229409 0.233103 0.232720 0.228409 0.229434 0.230573 0.230327 0.238291 0.225543
chargesum: 0.00000
title: Mulliken charges with hydrogens summed into heavy atoms:
elementType: S O O N C C C C C C C C C C C C C C C C C C C C C
charge: 0.858268 -0.542346 -0.551113 -0.164495 -0.307419 0.068577 -0.184980 0.576554 0.522225 0.481571 0.006749 -0.185583 -0.190128 -0.089138 -0.180184 -0.139352 -0.020366 0.040692 -0.130697 -0.182796 0.005987 -0.014048 0.437668 -0.004543 -0.111104
polarizability: 3.60017598e+02 -2.48824767e+01 2.62599904e+02 -1.35567703e+01 9.30402680e+00 1.92904795e+02
1716.lowfreq: -28.1183 -8.9585 -4.8086 0.0007 0.0010 0.0014 4.7590 17.7661 33.0247
frequency: -28.0421 16.5471 33.0039 35.0295 45.2988 50.5577 67.0351 96.0654 135.4210 141.4619 161.3787 174.8467 190.3903 205.8337 214.9872 226.7490 243.7872 288.4772 307.2937 323.7932 349.8810 393.8076 401.2528 404.5513 411.9528 444.5785 460.4960 465.2050 486.5222 509.5396 523.4246 536.3741 547.4066 599.0607 602.6993 616.9618 635.5759 651.5976 655.9163 696.6873 715.1526 729.8847 757.1648 764.7022 773.4225 797.8453 816.8666 834.5318 843.8023 845.1889 848.2793 851.8549 866.7571 917.7472 925.3676 946.8409 953.8338 973.3614 975.5758 977.5327 984.7880 989.6134 997.6447 1003.4535 1010.0460 1015.1961 1028.0508 1033.5944 1047.5600 1084.4913 1094.7575 1115.3993 1131.8098 1133.7238 1170.9957 1174.7689 1189.5742 1194.2127 1200.5091 1212.2182 1223.0937 1245.3114 1271.9126 1274.9159 1305.2217 1323.9846 1330.3856 1356.5026 1377.6231 1382.0714 1386.3826 1398.1253 1408.9629 1427.1217 1443.9401 1469.9325 1474.7532 1477.1730 1484.1492 1493.7868 1506.4651 1572.3952 1585.1320 1589.0061 1611.3906 1619.6646 1623.4634 2948.2253 2979.2950 3058.6887 3073.4197 3087.8847 3117.9633 3119.3715 3120.1017 3124.1494 3131.5788 3138.8413 3143.0527 3144.6913 3145.3012 3149.4217 3158.4938 3169.4215 3174.8116 3555.1276
redmass: 1.0273 3.9817 5.0008 6.2248 4.0914 4.3648 4.7893 5.3068 7.5861 4.8299 6.4282 5.7444 6.2890 6.0944 5.2579 7.0444 5.0118 5.5967 5.3839 5.0822 2.8286 7.8705 2.8093 2.7872 4.9295 2.9401 1.4837 6.0961 3.3923 4.2963 3.6096 3.7490 4.4353 3.9616 5.7009 6.1764 6.6682 5.5411 6.7219 1.6837 3.4373 3.0734 1.3083 3.6719 2.4274 6.8548 2.2273 3.0668 2.3173 1.3034 1.7309 1.2590 4.5576 5.4861 1.7476 1.3612 1.3357 1.4028 1.4205 1.3273 1.5443 4.0488 1.4704 6.5387 3.7278 2.9596 2.2754 2.1668 1.5682 1.8107 2.7744 1.2666 1.2407 1.5772 1.0654 1.0601 1.1681 1.1245 1.5340 2.3396 2.8173 1.4748 1.9192 1.7386 1.7733 1.3657 1.4204 1.3533 2.8673 3.8382 6.9222 1.2717 2.5834 2.7354 2.1907 1.0550 1.1501 1.8892 2.2856 2.5647 2.7012 4.7349 6.0872 5.8881 6.0159 7.1634 6.3897 1.0824 1.0376 1.0970 1.0869 1.0991 1.0871 1.0875 1.0877 1.0862 1.0880 1.0962 1.0890 1.0963 1.0936 1.0939 1.0960 1.1006 1.0996 1.0767
irintensity: 0.4062 0.1249 0.6028 2.1480 0.6654 0.2895 1.4889 1.1965 0.7254 3.8510 4.9486 3.0751 2.7115 0.3664 1.0201 7.6834 1.4429 3.7486 10.8401 2.9133 0.1482 9.9320 1.2655 1.2973 21.9742 31.3733 55.5078 75.0970 0.9211 13.6380 23.3636 8.8998 9.4488 19.6063 0.9147 1.1182 0.4624 2.3321 4.2397 49.3855 1.9092 6.3172 103.9260 3.4666 9.4709 84.2976 17.3637 23.7776 17.8187 1.5531 4.3770 1.4555 12.9490 49.4077 7.9541 1.7169 1.9089 0.1753 0.1506 0.3101 1.2124 0.2148 0.2070 4.1700 4.7701 6.5341 5.4440 0.9990 12.8354 25.4989 25.1262 2.2929 8.6529 14.6032 4.4160 0.1356 8.7970 2.3192 0.9683 4.6553 1.3386 1.5803 26.6667 3.5254 5.2773 13.9738 5.6008 44.2304 11.9824 2.0970 1.0546 13.5271 4.0709 14.2437 13.1931 13.0858 25.5416 10.6964 32.1490 221.1871 29.3024 16.4065 0.2534 2.7842 1.0450 142.2253 7.5241 16.2793 34.1148 18.5115 4.1676 17.3380 6.2397 24.2957 5.8046 3.2386 1.4482 28.5876 12.6811 6.5426 17.8817 5.6755 24.9473 16.2078 25.5851 38.6282
temp: 298.150 k
press: 1.00000 atm
elementType: 16 8 8 7 6 6 6 6 6 6 6 6 6 6 6 6 6 6 6 6 6 6 6 6 6 1 1 1 1 1 1 1 1 1 1 1 1 1 1 1 1 1 1 1
symmnumber: 1
zpe: 900083.9 jmol-1
zpe.correction: 0.342824 hartree
zpe.thermalcorrener: 0.364462 hartree
zpe.thermalcorrenthalpy: 0.365406 hartree
zpe.thermalcorrgfe: 0.290473 hartree
zpe.sumelectzpe: -1412.988093 hartree
zpe.sumelectthermal: -1412.966455 hartree
zpe.sumelectthermalent: -1412.965510 hartree
zpe.sumelectthermalfe: -1413.040444 hartree
dipole: -4.8729 -5.9121 -1.7538
dipole: 7.8597
quadrupole: -138.4210 -150.0526 -153.0843
quadrupole: -15.4143 -5.8516 -0.1914
quadrupole: 8.7650 -2.8667 -5.8983 -15.4143 -5.8516 -0.1914
hfenergy: -1413.3309167 hartree
pointgroup: C01 [X(C21H19N1O2S1)]
dipole: -1.7543538 2.3726838 0.9243743 debye
polarizability: 363.1927881|17.6366635|257.9824898|12.8418469|13.7105338|194.3470189 unknown
InChI: InChI=1S/C21H19NO2S/c1-15-11-13-16(14-12-15)20-21(17-7-3-2-4-8-17)25(23,24)19-10-6-5-9-18(19)22-20/h2-14,20-22H,1H3
charge 0 multiplicity 1
44 atoms
S  2.001194 -1.436465 -0.503296
O  2.553587 -2.737224 0.31587
O  1.768819 -1.535219 -2.12934
N  1.145913 1.571418 -0.341056
C  0.256978 -0.701372 0.225724
C  0.067119 0.590864 -0.610887
C  3.08481 0.032227 -0.108133
C  -0.785147 -1.764527 0.108923
C  2.501441 1.329258 -0.133608
C  -1.278184 1.247306 -0.295286
C  4.438005 -0.207017 0.186141
C  3.391324 2.421425 0.114034
C  -1.28562 -2.373778 1.289356
C  -1.269329 -2.201952 -1.154704
C  -2.312344 1.269848 -1.260709
C  -1.513116 1.842453 0.96933
C  5.290592 0.887195 0.434692
C  4.752673 2.199204 0.382706
C  -3.554751 1.869665 -0.96728
C  -2.757294 2.443108 1.25801
C  -2.270797 -3.380701 1.215583
C  -2.248829 -3.213909 -1.225343
C  -3.801448 2.464953 0.297527
C  -2.757716 -3.801844 -0.043544
C  -5.147444 3.094412 0.610943
H  0.537043 -0.484584 1.269935
H  0.084381 0.291718 -1.681869
H  0.860724 2.548258 -0.416893
H  4.800193 -1.24033 0.222523
H  2.993436 3.443693 0.100517
H  -0.90122 -2.055289 2.265774
H  -0.850007 -1.783066 -2.074706
H  -2.143544 0.817377 -2.245173
H  -0.71978 1.841526 1.726674
H  6.348731 0.72575 0.65908
H  5.404389 3.060948 0.565068
H  -4.343844 1.878954 -1.728979
H  -2.923304 2.899163 2.241465
H  -2.651354 -3.840727 2.133988
H  -2.606903 -3.554525 -2.203107
H  -3.518096 -4.588538 -0.103522
H  -5.46324 3.790737 -0.187448
H  -5.935801 2.322672 0.698999
H  -5.121838 3.655036 1.56092
