program: Gaussian 09
title: 000284364
version: EM64L-G09RevD.01
frameworkgroup: C1[X(C14H12ClNO4S)]
method: RPBEPBE
basis: SDD
operation: Freq
keyword: #p
keyword: freq=noraman
keyword: PBEPBE/SDD
title: #p freq=noraman PBEPBE/SDD
converged: YES YES NO NO
title: Mulliken charges:
elementType: Cl S O O O O N C C C C C C C C C C C C C C H H H H H H H H H H H H
charge: -0.041151 0.896139 -0.534696 -0.535532 -0.195023 -0.193415 0.026394 -0.567030 -0.600168 -0.103472 0.619656 -0.163575 -0.221343 -0.417077 -0.360050 -0.347634 -0.338722 0.394135 -0.229124 -0.225549 -0.235983 0.285254 0.328365 0.330507 0.307246 0.304437 0.257952 0.245184 0.298239 0.299160 0.240939 0.235279 0.240656
chargesum: 0.00000
title: Mulliken charges with hydrogens summed into heavy atoms:
elementType: Cl S O O O O N C C C C C C C C C C C C C C
charge: -0.041151 0.896139 -0.534696 -0.535532 -0.195023 -0.193415 0.026394 0.046590 -0.269661 -0.103472 0.619656 0.143671 0.083094 -0.159125 -0.114865 -0.049395 -0.039562 0.394135 0.011815 0.009730 0.004673
polarizability: 2.50503380e+02 2.72840142e+01 2.11444320e+02 -1.09748234e+01 2.37750895e+01 1.58851142e+02
1716.lowfreq: -7.7289 -6.1518 -1.6272 -0.0010 -0.0008 0.0006 12.4092 23.1878 36.9436
frequency: 11.6450 23.0184 36.9245 51.6032 57.9420 70.0994 95.7979 104.5243 123.1728 129.2607 179.8617 191.0310 203.3897 209.6761 230.8128 272.4451 275.3133 341.5234 361.2878 387.1935 400.0941 410.1265 429.0847 465.3123 483.7207 505.2034 509.3343 548.3331 563.7987 612.2949 612.8318 653.4809 661.7141 679.2871 701.4812 733.7696 758.6795 779.5270 783.7657 790.1325 852.4169 855.1527 873.4626 916.4122 925.2394 933.7133 979.6605 989.6078 992.1240 993.2558 1002.3067 1002.8099 1022.1031 1043.7076 1056.2828 1076.5092 1086.1979 1105.2489 1121.0347 1162.3755 1170.8114 1176.6381 1191.9180 1207.8177 1217.1965 1234.2569 1281.6199 1312.7782 1361.8231 1369.8410 1390.8506 1392.6527 1419.1775 1422.5249 1446.9384 1450.8410 1484.6728 1580.4614 1591.7635 1606.2363 1609.8364 3057.6266 3097.4752 3127.0543 3134.8274 3145.4837 3154.8151 3156.2544 3156.3606 3165.1254 3170.5868 3187.5243 3189.9535
redmass: 6.3309 10.6203 8.4643 4.7846 5.4741 5.4768 8.1259 9.8674 7.8799 8.9282 8.7149 8.4175 7.4022 4.1252 8.6952 7.1730 5.2441 6.6951 10.8388 8.4779 2.8250 2.8800 4.4439 8.5064 4.0639 7.2811 3.9176 3.9180 6.1293 6.5580 6.7622 4.9985 4.9685 8.2788 1.6597 4.3002 3.4673 8.5405 2.2415 7.8108 1.2572 1.2525 1.5216 1.7047 14.5328 1.5078 1.4529 2.9134 1.8938 3.9925 1.3740 1.3458 2.5018 2.2773 2.4171 1.4648 4.0223 1.2847 1.3740 1.1323 1.2229 1.0590 1.1147 1.4255 8.9300 1.6462 1.2459 1.5012 1.7375 6.1754 5.7919 3.7698 1.1156 7.0705 2.0797 2.1451 2.3147 6.1862 5.9193 8.3813 5.9979 1.0565 1.0873 1.0871 1.0871 1.0920 1.1103 1.0912 1.0969 1.0909 1.1016 1.0948 1.0962
irintensity: 0.0993 0.7525 0.0829 1.0191 1.3754 0.0559 7.9998 9.3156 3.3447 1.5886 0.2132 5.9002 2.0444 0.7521 1.0365 1.5669 3.7072 3.7417 29.4249 71.7415 1.0297 0.5415 0.4443 31.3329 33.0201 1.5592 18.4064 16.9721 3.1497 2.9184 0.6998 54.3109 29.1017 32.9807 80.5547 7.9262 1.2993 61.7440 36.0294 19.3005 1.4625 3.9392 50.3408 41.0149 77.5809 6.6280 0.2018 1.8046 2.1406 2.1299 0.6107 0.5209 3.2127 27.8625 11.9610 2.2831 5.6035 7.4200 10.5075 0.9375 15.5130 0.1801 1.4280 10.4763 235.6914 25.6626 0.1770 9.4804 4.8239 50.4730 60.1711 2.2122 14.6133 40.3638 16.0683 6.4059 3.1238 16.3532 0.6843 0.3385 2.0899 4.9392 1.0061 2.9603 0.0812 9.3480 0.3297 5.4968 18.9910 6.5866 12.1191 3.2585 1.4839
temp: 298.150 k
press: 1.00000 atm
elementType: 17 16 8 8 8 8 7 6 6 6 6 6 6 6 6 6 6 6 6 6 6 1 1 1 1 1 1 1 1 1 1 1 1
symmnumber: 1
zpe: 610644.9 jmol-1
zpe.correction: 0.232582 hartree
zpe.thermalcorrener: 0.252511 hartree
zpe.thermalcorrenthalpy: 0.253455 hartree
zpe.thermalcorrgfe: 0.180569 hartree
zpe.sumelectzpe: -1752.701696 hartree
zpe.sumelectthermal: -1752.681767 hartree
zpe.sumelectthermalent: -1752.680823 hartree
zpe.sumelectthermalfe: -1752.753710 hartree
dipole: -1.1807 2.9746 -1.5449
dipole: 3.5537
quadrupole: -168.5948 -142.2621 -136.3184
quadrupole: -8.5006 0.3379 11.3587
quadrupole: -19.5364 6.7963 12.7400 -8.5006 0.3379 11.3587
hfenergy: -1752.9342787 hartree
pointgroup: C01 [X(C14H12Cl1N1O4S1)]
dipole: -0.9337996 0.9455309 -0.4344808 debye
polarizability: 221.0913546|34.8457811|230.7399999|-12.0403914|32.8924153|168.9674888 unknown
InChI: InChI=1S/C14H12ClNO4S/c15-14(11-4-2-1-3-5-11)10-21(19,20)13-8-6-12(7-9-13)16(17)18/h1-9,14H,10H2
charge 0 multiplicity 1
33 atoms
Cl -4.241224 -1.818258 -1.972649
S  -0.191729 -2.377439 0.06778
O  0.742015 -3.581961 -0.526399
O  -0.926284 -2.476744 1.527704
O  3.16653 3.519234 0.933886
O  4.56932 2.482515 -0.536189
N  3.502168 2.523648 0.186133
C  -1.606969 -2.083783 -1.295067
C  -2.867112 -1.570588 -0.619986
C  0.911791 -0.823902 0.081286
C  -2.855616 -0.137337 -0.156567
C  0.560319 0.254098 0.909542
C  2.08001 -0.870671 -0.698137
C  -3.204076 0.155313 1.186553
C  -2.496911 0.923865 -1.028433
C  1.424993 1.367601 0.945069
C  2.943204 0.244318 -0.664252
C  2.592833 1.342597 0.151674
C  -3.179336 1.487679 1.656731
C  -2.476243 2.253946 -0.560219
C  -2.813626 2.539511 0.785003
H  -1.154037 -1.39533 -2.023826
H  -1.70955 -3.101368 -1.703185
H  -3.181148 -2.25427 0.182724
H  -0.346737 0.219396 1.519994
H  2.314759 -1.766554 -1.282389
H  -3.47748 -0.661803 1.863095
H  -2.266375 0.71469 -2.079643
H  1.210791 2.240235 1.566748
H  3.869278 0.274594 -1.243715
H  -3.449136 1.703294 2.696077
H  -2.206712 3.068653 -1.240831
H  -2.801405 3.573723 1.145989
